Thanks Thanks:  107
Seite 9 von 37 ErsteErste ... 789101119 ... LetzteLetzte
Ergebnis 81 bis 90 von 366
  1. #81
    Mitglied
    Registriert seit
    02.10.2013
    Beiträge
    46
    Total Downloaded
    0
    Total Downloaded
    0
    ReceiverDankeAktivitäten
    Box 1:
    Golden Media Reloaded SPARK
     
     
    Code:
    | cmNinjaTargetGenerator.o:cmNinjaTargetGenerator.cxx:function cmNinjaTargetGenerator::cmNinjaTargetGenerator(cmTarget*): error: undefined reference to 'cmGlobalGenerator::GetGeneratorTarget(cmTarget*) const'
    | collect2: ld returned 1 exit status
    | make: *** [cmake] Error 1
    | ---------------------------------------------
    | Error when bootstrapping CMake:
    | Problem while running make
    | ---------------------------------------------
    | Log of errors: /home/spark7111/Desktop/openatv/build-enviroment/builds/openatv/spark/tmp/work/i686-linux/cmake-native/2.8.12.2-r0/cmake-2.8.12.2/Bootstrap.cmk/cmake_bootstrap.log
    | ---------------------------------------------
    | WARNING: /home/spark7111/Desktop/openatv/build-enviroment/builds/openatv/spark/tmp/work/i686-linux/cmake-native/2.8.12.2-r0/temp/run.do_configure.3774:1 exit 9 from
    |   ./configure --prefix=/home/spark7111/Desktop/openatv/build-enviroment/builds/openatv/spark/tmp/sysroots/i686-linux/usr -- -DBUILD_CursesDialog=0 -DENABLE_ACL=0 -DHAVE_ACL_LIBACL_H=0
    | ERROR: Function failed: do_configure (log file is located at /home/spark7111/Desktop/openatv/build-enviroment/builds/openatv/spark/tmp/work/i686-linux/cmake-native/2.8.12.2-r0/temp/log.do_configure.3774)
    ERROR: Task 8626 (/home/spark7111/Desktop/openatv/build-enviroment/openembedded-core/meta/recipes-devtools/cmake/cmake-native_2.8.12.2.bb, do_configure) failed with exit code '1'
    NOTE: Tasks Summary: Attempted 1803 tasks of which 1779 didn't need to be rerun and 3 failed.
    Waiting for 0 running tasks to finish:
    
    
    Summary: 3 tasks failed:
      /home/spark7111/Desktop/openatv/build-enviroment/meta-oe-alliance/meta-oe/recipes-multimedia/gstreamer/gst-plugins-ugly_0.10.19.1.bb, do_unpack
      /home/spark7111/Desktop/openatv/build-enviroment/openembedded-core/meta/recipes-devtools/gcc/gcc-cross-initial_4.8.bb, do_compile
      /home/spark7111/Desktop/openatv/build-enviroment/openembedded-core/meta/recipes-devtools/cmake/cmake-native_2.8.12.2.bb, do_configure
    Summary: There were 48 WARNING messages shown.
    Summary: There were 3 ERROR messages shown, returning a non-zero exit code.
    make: *** [image] Error 1
    spark7111@ubuntu:~/Desktop/openatv/build-enviroment$
    Geändert von pop1234 (27.07.2014 um 10:54 Uhr)
    Golden Media Reloaded SPARK Sti7111

    •   Alt Advertising

       

  2. #82
    Avatar von Captain
    Registriert seit
    03.04.2013
    Beiträge
    9.705
    Themenstarter
    Total Downloaded
    162,35 MB
    Total Downloaded
    162,35 MB
    ReceiverDankeAktivitäten
    no idea for your build issue

  3. #83
    Anfänger
    Registriert seit
    21.07.2014
    Beiträge
    23
    Total Downloaded
    0
    Total Downloaded
    0
    ReceiverDankeAktivitäten
    Kann mir jemand kurz mitteilen, welches recipe ich wie anpassen muss, um root ein Passwort zu geben, damit ich ssh von Anfang an (also ohne Passwort-Vergabe via telnet) nutzen kann? Danke im Voraus!

  4. #84
    Avatar von Captain
    Registriert seit
    03.04.2013
    Beiträge
    9.705
    Themenstarter
    Total Downloaded
    162,35 MB
    Total Downloaded
    162,35 MB
    ReceiverDankeAktivitäten

  5. #85
    Anfänger
    Registriert seit
    19.07.2014
    Beiträge
    28
    Total Downloaded
    4,60 MB
    Total Downloaded
    4,60 MB
    ReceiverDankeAktivitäten
    Hi,
    I am facing following error:
    WARNING: Unable to get checksum for linux-azbox SRC_URI entry defconfig: file could not be found | ETA: 00:01:39
    WARNING: Unable to get checksum for linux-azbox SRC_URI entry defconfig: file could not be found
    ERROR: ExpansionError during parsing /home/tahir/openatv/build-enviroment/meta-oe-alliance/meta-oe/recipes-oe-alliance/enigma2-plugins/enigma2-plugin-extensions-tuxcom.bb: Failure expanding variable SRCPV, expression was ${@bb.fetch2.get_srcrev(d)} which triggered exception FetchError: Fetcher failure: Fetch command failed with exit code 127, output:
    /usr/bin/env: svn: No such file or directory


    Summary: There were 44 WARNING messages shown.
    Summary: There was 1 ERROR message shown, returning a non-zero exit code.
    make: *** [image] Error 1
    tahir@Tahir-PC:~/openatv/build-enviroment$

  6. #86
    Mitglied
    Registriert seit
    02.10.2013
    Beiträge
    46
    Total Downloaded
    0
    Total Downloaded
    0
    ReceiverDankeAktivitäten
    Box 1:
    Golden Media Reloaded SPARK
     
     
    @engineerkhan15

    1- test this command in terminal

    Set your shell to /bin/bash.
    sudo dpkg-reconfigure dash
    When asked: Install dash as /bin/sh?
    select "NO"
    2- rebuild image
    Golden Media Reloaded SPARK Sti7111

  7. #87
    Anfänger
    Registriert seit
    19.07.2014
    Beiträge
    28
    Total Downloaded
    4,60 MB
    Total Downloaded
    4,60 MB
    ReceiverDankeAktivitäten
    Thanks for reply.
    I had done it already in previous attempt. But I did it again and encountered with the same error:
    tahir@Tahir-PC:~$ sudo dpkg-reconfigure dash
    [sudo] password for tahir:
    tahir@Tahir-PC:~$ cd ~/openatv/build-enviroment
    tahir@Tahir-PC:~/openatv/build-enviroment$ make update
    Updating Git repositories...
    Already up-to-date.
    Synchronizing submodule url for 'bitbake'
    Synchronizing submodule url for 'meta-oe-alliance'
    Synchronizing submodule url for 'meta-openembedded'
    Synchronizing submodule url for 'openembedded-core'
    Synchronizing submodule url for 'meta-oe/recipes-oe-alliance/enigma2-plugins/e2openplugins'
    The oe-alliance is now up-to-date.
    tahir@Tahir-PC:~/openatv/build-enviroment$ MACHINE=amiko8900 DISTRO=openatv make image
    NOTE: Started PRServer with DBfile: /home/tahir/openatv/build-enviroment/builds/openatv/spark/cache/prserv.sqlite3, IP: 127.0.0.1, PORT: 58708, PID: 2898
    Loading cache: 100% |################################################# ################################################## ########| ETA: 00:00:00
    Loaded 461 entries from dependency cache.
    WARNING: Unable to get checksum for linux-etxx00 SRC_URI entry defconfig: file could not be found | ETA: --:--:--
    WARNING: Unable to get checksum for linux-etxx00 SRC_URI entry defconfig: file could not be found
    WARNING: Unable to get checksum for linux-vuplus SRC_URI entry fix_cpu_proc.patch: file could not be found
    WARNING: Unable to get checksum for linux-vuplus SRC_URI entry defconfig: file could not be found
    WARNING: Unable to get checksum for linux-vuplus SRC_URI entry defconfig: file could not be found
    WARNING: Unable to get checksum for odin-backup SRC_URI entry odin-backup.sh: file could not be found
    WARNING: Unable to get checksum for linux-odin SRC_URI entry defconfig: file could not be found
    WARNING: Unable to get checksum for linux-odin SRC_URI entry spark-board.patch: file could not be found
    WARNING: Unable to get checksum for linux-skylake SRC_URI entry defconfig: file could not be found
    WARNING: Unable to get checksum for linux-ixuss SRC_URI entry defconfig: file could not be found
    WARNING: Unable to get checksum for linux-ini-hdx SRC_URI entry defconfig: file could not be found
    WARNING: Unable to get checksum for linux-ini-hde2 SRC_URI entry defconfig: file could not be found
    WARNING: Unable to get checksum for gigablue-dvb-modules-gb800ue SRC_URI entry ddbootup: file could not be found
    WARNING: Unable to get checksum for gigablue-dvb-modules-gb800ueplus SRC_URI entry ddbootup: file could not be found
    WARNING: Unable to get checksum for gigablue-dvb-modules-gbipbox SRC_URI entry ddbootup: file could not be found
    WARNING: Unable to get checksum for gigablue-dvb-modules-gb800seplus SRC_URI entry ddbootup: file could not be found
    WARNING: Unable to get checksum for gigablue-dvb-modules-gbquad SRC_URI entry ddbootup: file could not be found
    WARNING: Unable to get checksum for gigablue-dvb-modules-gbquadplus SRC_URI entry ddbootup: file could not be found
    WARNING: Unable to get checksum for gigablue-dvb-modules-gb800solo SRC_URI entry ddbootup: file could not be found
    WARNING: Unable to get checksum for gigablue-dvb-modules-gb800se SRC_URI entry ddbootup: file could not be found | ETA: 00:04:33
    WARNING: Unable to get checksum for gigablue-ethwol SRC_URI entry ethwol.sh: file could not be found
    WARNING: Unable to get checksum for linux-gigablue SRC_URI entry defconfig: file could not be found
    WARNING: Unable to get checksum for linux-gigablue SRC_URI entry defconfig: file could not be found
    WARNING: Unable to get checksum for linux-gigablue SRC_URI entry defconfig: file could not be found
    WARNING: Unable to get checksum for linux-gigablue SRC_URI entry defconfig: file could not be found
    WARNING: Unable to get checksum for linux-formuler SRC_URI entry defconfig: file could not be found
    WARNING: Unable to get checksum for linux-entwopia SRC_URI entry defconfig: file could not be found
    WARNING: Unable to get checksum for linux-ebox SRC_URI entry defconfig: file could not be found
    WARNING: Unable to get checksum for dreambox-dvb-modules-dm800se SRC_URI entry modules: file could not be found
    WARNING: Unable to get checksum for dreambox-dvb-modules-dm7020hd SRC_URI entry modules: file could not be found
    WARNING: Unable to get checksum for dreambox-dvb-modules-dm500hdv2 SRC_URI entry modules: file could not be found
    WARNING: Unable to get checksum for dreambox-dvb-modules-dm8000 SRC_URI entry modules: file could not be found
    WARNING: Unable to get checksum for dreambox-dvb-modules-dm500hd SRC_URI entry modules: file could not be found
    WARNING: Unable to get checksum for dreambox-dvb-modules-dm800sev2 SRC_URI entry modules: file could not be found
    WARNING: Unable to get checksum for dreambox-enigma2-config SRC_URI entry skin_box.xml: file could not be found
    WARNING: Unable to get checksum for linux-dreambox SRC_URI entry defconfig: file could not be found
    WARNING: Unable to get checksum for linux-dags SRC_URI entry defconfig: file could not be found | ETA: 00:05:04
    WARNING: Unable to get checksum for linux-cube SRC_URI entry defconfig: file could not be found
    WARNING: Unable to get checksum for linux-blackbox SRC_URI entry defconfig: file could not be found
    WARNING: Unable to get checksum for linux-azbox SRC_URI entry defconfig: file could not be found
    WARNING: Unable to get checksum for linux-azbox SRC_URI entry defconfig: file could not be found
    ERROR: ExpansionError during parsing /home/tahir/openatv/build-enviroment/meta-oe-alliance/meta-oe/recipes-oe-alliance/enigma2-plugins/enigma2-plugin-extensions-tuxcom.bb: Failure expanding variable SRCPV, expression was ${@bb.fetch2.get_srcrev(d)} which triggered exception FetchError: Fetcher failure: Fetch command failed with exit code 127, output:
    /usr/bin/env: svn: No such file or directory



    Summary: There were 41 WARNING messages shown.
    Summary: There was 1 ERROR message shown, returning a non-zero exit code.
    make: *** [image] Error 1
    tahir@Tahir-PC:~/openatv/build-enviroment$
    Geändert von engineerkhan15 (29.07.2014 um 11:18 Uhr)

  8. #88
    Mitglied
    Registriert seit
    02.10.2013
    Beiträge
    46
    Total Downloaded
    0
    Total Downloaded
    0
    ReceiverDankeAktivitäten
    Box 1:
    Golden Media Reloaded SPARK
     
     
    Set your shell to /bin/bash.
    sudo dpkg-reconfigure dash
    When asked: Install dash as /bin/sh?
    select "NO"

    like this

    http://www.opena.tv/attachment.php?a...4&d=1405862675



    Golden Media Reloaded SPARK Sti7111

  9. #89
    Anfänger
    Registriert seit
    19.07.2014
    Beiträge
    28
    Total Downloaded
    4,60 MB
    Total Downloaded
    4,60 MB
    ReceiverDankeAktivitäten
    Yes I did same and when asked "Install dash as /bin/sh?" I selected NO.
    Than I got same error again.

  10. #90
    Avatar von Captain
    Registriert seit
    03.04.2013
    Beiträge
    9.705
    Themenstarter
    Total Downloaded
    162,35 MB
    Total Downloaded
    162,35 MB
    ReceiverDankeAktivitäten
    svn: No such file or directory

    your issue install svn tools


Seite 9 von 37 ErsteErste ... 789101119 ... LetzteLetzte

Stichworte

Lesezeichen

Berechtigungen

  • Neue Themen erstellen: Nein
  • Themen beantworten: Nein
  • Anhänge hochladen: Nein
  • Beiträge bearbeiten: Nein
  •  
Diese Website benutzt Cookies
Wir benutzen Cookies um Sitzungsinformationen zu speichern. Dies erleichtert es uns z.B. Dich an Deine Login zu erinnern, Einstellungen der Webseite zu speichern, Inhalte und Werbung zu personalisieren, Social Media Funktionen anzubieten und unser Datenaufkommen zu analysieren. Wir teilen diese Informationen ebenfalls mit unseren Social Media-, Werbe- und Analysepartnern.
     
Alle Zeitangaben in WEZ +1. Es ist jetzt 23:26 Uhr.
Powered by vBulletin® Version 4.2.3 (Deutsch)
Copyright ©2017 Adduco Digital e.K. und vBulletin Solutions, Inc. Alle Rechte vorbehalten.
Resources saved on this page: MySQL 5,88%
Parts of this site powered by vBulletin Mods & Addons from DragonByte Technologies Ltd. (Details)
vBulletin Skin By: PurevB.com