Thanks Thanks:  110
Seite 23 von 38 ErsteErste ... 13212223242533 ... LetzteLetzte
Ergebnis 221 bis 230 von 372
  1. #221
    Senior Mitglied
    Registriert seit
    19.07.2015
    Beiträge
    234
    Total Downloaded
    62,24 MB
    Total Downloaded
    62,24 MB
    ReceiverDankeAktivitäten
    Box 1:
    VU+ Ultimo OpenATV 5.3
     
     
    Box 2:
    VU+ Uno OpenATV 5.3
     
     
    Box 3:
    VU+ Uno OpenATV 5.3
     
     
    ok, captain hatte mir den link gesendet, hab dann die opera-hbtv in den source ordner gepakt und den build vorgang neu gestartet.

    jetzt fehlt mir eine youtube source, wo finde ich die passende und könnten noch mehr fehler von der art kommenß

    danke

    •   Alt Advertising

       

  2. #222
    Avatar von madie
    Registriert seit
    05.04.2013
    Beiträge
    7.930
    Total Downloaded
    289,07 MB
    Total Downloaded
    289,07 MB
    ReceiverDankeAktivitäten
    Box 1:
    AX HD51
     
     
    jo kommt leider immer wieder vor, das server genau dann nicht erreichbar sind, wenn man sie braucht. deshalb immer eine sicherung des source ordners machen.

  3. #223
    Avatar von betacentauri
    Registriert seit
    15.06.2013
    Beiträge
    1.347
    Total Downloaded
    1,32 MB
    Total Downloaded
    1,32 MB
    ReceiverDankeAktivitäten
    Box 1:
    ET-9200
     
     
    Box 2:
    ET-10000
     
     
    Box 3:
    ET-8500
     
     
    Box 4:
    ET-8000
     
     
    Box 5:
    Gigablue Quad+
     
     
    Bitte mal das Log hier anhängen damit wir genau wissen, welche Datei fehlt. Und ja, leider können noch ein paar solcher Fehler auftreten. Wenn du einmal alle Dateien hast, treten solche Probleme nur noch sehr selten auf, da die Sourcen gespeichert und wiederverwendet werden.
    ET-10000, ET-9200, ET-8000, Gigablue Quad+

  4. #224
    Senior Mitglied
    Registriert seit
    19.07.2015
    Beiträge
    234
    Total Downloaded
    62,24 MB
    Total Downloaded
    62,24 MB
    ReceiverDankeAktivitäten
    Box 1:
    VU+ Ultimo OpenATV 5.3
     
     
    Box 2:
    VU+ Uno OpenATV 5.3
     
     
    Box 3:
    VU+ Uno OpenATV 5.3
     
     
    ,hhi,
    es fehlt
    Code:
    a2-plugin-extensions-youtube/gitAUTOINC+6d80e3efd7-r0/temp/log.do_compile.9560)
    ERROR: Task 5395 (/home/thomas/openatv/build-enviroment/meta-oe-alliance/meta-oe/recipes-oe-alliance/enigma2-plugins/enigma2-plugin-extensions-youtube.bb, do_compile) failed with exit code '1'
    WARNING: QA Issue: enigma2-plugin-extensions-bitrate: configure was passed unrecognised options: --with-boxtype [unknown-configure-option]
    NOTE: Tasks Summary: Attempted 9258 tasks of which 9149 didn't need to be rerun and 1 failed.

  5. #225
    Anfänger
    Registriert seit
    26.04.2015
    Beiträge
    3
    Total Downloaded
    0
    Total Downloaded
    0
    ReceiverDankeAktivitäten
    Einfach den build neu anstossen, das klemmt ab und an

    Gesendet von meinem SM-G900F mit Tapatalk

  6. #226
    Anfänger
    Registriert seit
    06.10.2015
    Beiträge
    10
    Total Downloaded
    0
    Total Downloaded
    0
    ReceiverDankeAktivitäten
    Box 1:
    GigaBlue HD Quad Plus
     
     
    Box 2:
    Dreambox DM800
     
     
    Box 3:
    GigaBlue HD X1
     
     
    Box 4:
    VDR-2.2.0
     
     
    Box 5:
    Humax PR-HD3000 (kompletter Müll ;-)
     
     
    Was ist hier los?

    Jungfräuliche Build-Umgebung vorhanden und alles nach Anleitung angestoßen, und dennoch erhalte ich diese Fehlermeldung. Hat jemand eine Idee? TIA!

    Code:
    |Build Configuration:
    BB_VERSION        = "1.27.1"
    BUILD_SYS         = "x86_64-linux"
    NATIVELSBSTRING   = "Ubuntu-12.04"
    TARGET_SYS        = "mipsel-oe-linux"
    MACHINE           = "gbquadplus"
    DISTRO            = "openatv"
    DISTRO_VERSION    = "5.1"
    TUNE_FEATURES     = "o32 fpu-hard mips32"
    TARGET_FPU        = ""
    meta              = "(nobranch):705c276caa9d30828887ebc3d85d49ca496d991e"
    meta-oe           
    meta-multimedia   
    meta-networking   
    meta-filesystems  
    meta-python       = "(nobranch):c12b9596afd236116b25ce26dbe0d793de9dc7ce"
    meta-oe           
    meta-airdigital   
    meta-azbox        
    meta-ax           
    meta-blackbox     
    meta-ceryon       
    meta-cube         
    meta-dags         
    meta-dream        
    meta-ebox         
    meta-entwopia     
    meta-formuler     
    meta-fulan        
    meta-gigablue     
    meta-ini          
    meta-ixuss        
    meta-broadmedia   
    meta-odin         
    meta-skylake      
    meta-tripledot    
    meta-ultramini    
    meta-vuplus       
    meta-wetek        
    meta-xp           
    meta-xtrend       
    meta-xcore        = "(nobranch):a0bb11f6f70e31082edabd818d71a68472ebec57"
    meta-local        = "3.2:ac8378d0744f2ae5b6c3e4388211af041952c935"
    
    NOTE: Preparing RunQueue
    NOTE: Executing SetScene Tasks
    NOTE: Executing RunQueue Tasks
    WARNING: Failed to fetch URL http://download.berlios.de/pythonwifi/python-wifi-0.5.0.tar.bz2, attempting MIRRORS if available
    ERROR: Function failed: do_compile (log file is located at /home/openatv/build-enviroment/builds/openatv/release/gbquadplus/tmp/work/x86_64-linux/gperf-native/3.0.4-r0/temp/log.do_compile.29228)
    ERROR: Logfile of failure stored in: /home/openatv/build-enviroment/builds/openatv/release/gbquadplus/tmp/work/x86_64-linux/gperf-native/3.0.4-r0/temp/log.do_compile.29228
    Log data follows:
    | DEBUG: Executing shell function do_compile
    | NOTE: make -j 8
    | cd lib; make all
    | make[1]: Entering directory `/home/openatv/build-enviroment/builds/openatv/release/gbquadplus/tmp/work/x86_64-linux/gperf-native/3.0.4-r0/build/lib'
    | gcc  -isystem/home/openatv/build-enviroment/builds/openatv/release/gbquadplus/tmp/sysroots/x86_64-linux/usr/include -march=native -O2 -pipe -I/home/openatv/build-enviroment/builds/openatv/release/gbquadplus/tmp/work/x86_64-linux/gperf-native/3.0.4-r0/gperf-3.0.4/lib -c /home/openatv/build-enviroment/builds/openatv/release/gbquadplus/tmp/work/x86_64-linux/gperf-native/3.0.4-r0/gperf-3.0.4/lib/getopt.c
    | gcc  -isystem/home/openatv/build-enviroment/builds/openatv/release/gbquadplus/tmp/sysroots/x86_64-linux/usr/include -march=native -O2 -pipe -I/home/openatv/build-enviroment/builds/openatv/release/gbquadplus/tmp/work/x86_64-linux/gperf-native/3.0.4-r0/gperf-3.0.4/lib -c /home/openatv/build-enviroment/builds/openatv/release/gbquadplus/tmp/work/x86_64-linux/gperf-native/3.0.4-r0/gperf-3.0.4/lib/getopt1.c
    | g++  -isystem/home/openatv/build-enviroment/builds/openatv/release/gbquadplus/tmp/sysroots/x86_64-linux/usr/include -march=native -O2 -pipe -I/home/openatv/build-enviroment/builds/openatv/release/gbquadplus/tmp/work/x86_64-linux/gperf-native/3.0.4-r0/gperf-3.0.4/lib -c /home/openatv/build-enviroment/builds/openatv/release/gbquadplus/tmp/work/x86_64-linux/gperf-native/3.0.4-r0/gperf-3.0.4/lib/getline.cc
    | g++  -isystem/home/openatv/build-enviroment/builds/openatv/release/gbquadplus/tmp/sysroots/x86_64-linux/usr/include -march=native -O2 -pipe -I/home/openatv/build-enviroment/builds/openatv/release/gbquadplus/tmp/work/x86_64-linux/gperf-native/3.0.4-r0/gperf-3.0.4/lib -c /home/openatv/build-enviroment/builds/openatv/release/gbquadplus/tmp/work/x86_64-linux/gperf-native/3.0.4-r0/gperf-3.0.4/lib/hash.cc
    | rm -f libgp.a
    | ar rc libgp.a getopt.o getopt1.o getline.o hash.o
    | ranlib libgp.a
    | make[1]: Leaving directory `/home/openatv/build-enviroment/builds/openatv/release/gbquadplus/tmp/work/x86_64-linux/gperf-native/3.0.4-r0/build/lib'
    | cd src; make all
    | make[1]: Entering directory `/home/openatv/build-enviroment/builds/openatv/release/gbquadplus/tmp/work/x86_64-linux/gperf-native/3.0.4-r0/build/src'
    | g++  -isystem/home/openatv/build-enviroment/builds/openatv/release/gbquadplus/tmp/sysroots/x86_64-linux/usr/include -march=native -O2 -pipe -I. -I/home/openatv/build-enviroment/builds/openatv/release/gbquadplus/tmp/work/x86_64-linux/gperf-native/3.0.4-r0/gperf-3.0.4/src/../lib -c /home/openatv/build-enviroment/builds/openatv/release/gbquadplus/tmp/work/x86_64-linux/gperf-native/3.0.4-r0/gperf-3.0.4/src/version.cc
    | g++  -isystem/home/openatv/build-enviroment/builds/openatv/release/gbquadplus/tmp/sysroots/x86_64-linux/usr/include -march=native -O2 -pipe -I. -I/home/openatv/build-enviroment/builds/openatv/release/gbquadplus/tmp/work/x86_64-linux/gperf-native/3.0.4-r0/gperf-3.0.4/src/../lib -c /home/openatv/build-enviroment/builds/openatv/release/gbquadplus/tmp/work/x86_64-linux/gperf-native/3.0.4-r0/gperf-3.0.4/src/positions.cc
    | g++  -isystem/home/openatv/build-enviroment/builds/openatv/release/gbquadplus/tmp/sysroots/x86_64-linux/usr/include -march=native -O2 -pipe -I. -I/home/openatv/build-enviroment/builds/openatv/release/gbquadplus/tmp/work/x86_64-linux/gperf-native/3.0.4-r0/gperf-3.0.4/src/../lib -c /home/openatv/build-enviroment/builds/openatv/release/gbquadplus/tmp/work/x86_64-linux/gperf-native/3.0.4-r0/gperf-3.0.4/src/options.cc
    | g++  -isystem/home/openatv/build-enviroment/builds/openatv/release/gbquadplus/tmp/sysroots/x86_64-linux/usr/include -march=native -O2 -pipe -I. -I/home/openatv/build-enviroment/builds/openatv/release/gbquadplus/tmp/work/x86_64-linux/gperf-native/3.0.4-r0/gperf-3.0.4/src/../lib -c /home/openatv/build-enviroment/builds/openatv/release/gbquadplus/tmp/work/x86_64-linux/gperf-native/3.0.4-r0/gperf-3.0.4/src/keyword.cc
    | g++  -isystem/home/openatv/build-enviroment/builds/openatv/release/gbquadplus/tmp/sysroots/x86_64-linux/usr/include -march=native -O2 -pipe -I. -I/home/openatv/build-enviroment/builds/openatv/release/gbquadplus/tmp/work/x86_64-linux/gperf-native/3.0.4-r0/gperf-3.0.4/src/../lib -c /home/openatv/build-enviroment/builds/openatv/release/gbquadplus/tmp/work/x86_64-linux/gperf-native/3.0.4-r0/gperf-3.0.4/src/keyword-list.cc
    | g++  -isystem/home/openatv/build-enviroment/builds/openatv/release/gbquadplus/tmp/sysroots/x86_64-linux/usr/include -march=native -O2 -pipe -I. -I/home/openatv/build-enviroment/builds/openatv/release/gbquadplus/tmp/work/x86_64-linux/gperf-native/3.0.4-r0/gperf-3.0.4/src/../lib -c /home/openatv/build-enviroment/builds/openatv/release/gbquadplus/tmp/work/x86_64-linux/gperf-native/3.0.4-r0/gperf-3.0.4/src/input.cc
    | g++  -isystem/home/openatv/build-enviroment/builds/openatv/release/gbquadplus/tmp/sysroots/x86_64-linux/usr/include -march=native -O2 -pipe -I. -I/home/openatv/build-enviroment/builds/openatv/release/gbquadplus/tmp/work/x86_64-linux/gperf-native/3.0.4-r0/gperf-3.0.4/src/../lib -c /home/openatv/build-enviroment/builds/openatv/release/gbquadplus/tmp/work/x86_64-linux/gperf-native/3.0.4-r0/gperf-3.0.4/src/bool-array.cc
    | g++  -isystem/home/openatv/build-enviroment/builds/openatv/release/gbquadplus/tmp/sysroots/x86_64-linux/usr/include -march=native -O2 -pipe -I. -I/home/openatv/build-enviroment/builds/openatv/release/gbquadplus/tmp/work/x86_64-linux/gperf-native/3.0.4-r0/gperf-3.0.4/src/../lib -c /home/openatv/build-enviroment/builds/openatv/release/gbquadplus/tmp/work/x86_64-linux/gperf-native/3.0.4-r0/gperf-3.0.4/src/hash-table.cc
    | g++  -isystem/home/openatv/build-enviroment/builds/openatv/release/gbquadplus/tmp/sysroots/x86_64-linux/usr/include -march=native -O2 -pipe -I. -I/home/openatv/build-enviroment/builds/openatv/release/gbquadplus/tmp/work/x86_64-linux/gperf-native/3.0.4-r0/gperf-3.0.4/src/../lib -c /home/openatv/build-enviroment/builds/openatv/release/gbquadplus/tmp/work/x86_64-linux/gperf-native/3.0.4-r0/gperf-3.0.4/src/search.cc
    | g++  -isystem/home/openatv/build-enviroment/builds/openatv/release/gbquadplus/tmp/sysroots/x86_64-linux/usr/include -march=native -O2 -pipe -I. -I/home/openatv/build-enviroment/builds/openatv/release/gbquadplus/tmp/work/x86_64-linux/gperf-native/3.0.4-r0/gperf-3.0.4/src/../lib -c /home/openatv/build-enviroment/builds/openatv/release/gbquadplus/tmp/work/x86_64-linux/gperf-native/3.0.4-r0/gperf-3.0.4/src/output.cc
    | g++  -isystem/home/openatv/build-enviroment/builds/openatv/release/gbquadplus/tmp/sysroots/x86_64-linux/usr/include -march=native -O2 -pipe -I. -I/home/openatv/build-enviroment/builds/openatv/release/gbquadplus/tmp/work/x86_64-linux/gperf-native/3.0.4-r0/gperf-3.0.4/src/../lib -c /home/openatv/build-enviroment/builds/openatv/release/gbquadplus/tmp/work/x86_64-linux/gperf-native/3.0.4-r0/gperf-3.0.4/src/main.cc
    | /home/openatv/build-enviroment/builds/openatv/release/gbquadplus/tmp/work/x86_64-linux/gperf-native/3.0.4-r0/gperf-3.0.4/src/output.cc: In member function 'void Output::output_lookup_array() const':
    | /home/openatv/build-enviroment/builds/openatv/release/gbquadplus/tmp/work/x86_64-linux/gperf-native/3.0.4-r0/gperf-3.0.4/src/output.cc:1304:73: warning: format '%d' expects argument of type 'int', but argument 3 has type 'long int' [-Wformat]
    | {standard input}: Assembler messages:
    | {standard input}:961: Error: no such instruction: `vfmadd312sd .LC23(%rip),%xmm1,%xmm0'
    | make[1]: *** [output.o] Error 1
    | make[1]: *** Waiting for unfinished jobs....
    | make[1]: Leaving directory `/home/openatv/build-enviroment/builds/openatv/release/gbquadplus/tmp/work/x86_64-linux/gperf-native/3.0.4-r0/build/src'
    | make: *** [all] Error 2
    | ERROR: oe_runmake failed
    | WARNING: /home/openatv/build-enviroment/builds/openatv/release/gbquadplus/tmp/work/x86_64-linux/gperf-native/3.0.4-r0/temp/run.do_compile.29228:1 exit 1 from
    |   exit 1
    | ERROR: Function failed: do_compile (log file is located at /home/openatv/build-enviroment/builds/openatv/release/gbquadplus/tmp/work/x86_64-linux/gperf-native/3.0.4-r0/temp/log.do_compile.29228)
    ERROR: Task 538 (virtual:native:/home/openatv/build-enviroment/openembedded-core/meta/recipes-extended/gperf/gperf_3.0.4.bb, do_compile) failed with exit code '1'
    NOTE: Tasks Summary: Attempted 1086 tasks of which 0 didn't need to be rerun and 1 failed.
    Waiting for 0 running tasks to finish:
    
    Summary: 1 task failed:
      virtual:native:/home/openatv/build-enviroment/openembedded-core/meta/recipes-extended/gperf/gperf_3.0.4.bb, do_compile
    Summary: There were 74 WARNING messages shown.
    Summary: There was 1 ERROR message shown, returning a non-zero exit code.
    make: *** [image] Error 1

  7. #227
    Avatar von betacentauri
    Registriert seit
    15.06.2013
    Beiträge
    1.347
    Total Downloaded
    1,32 MB
    Total Downloaded
    1,32 MB
    ReceiverDankeAktivitäten
    Box 1:
    ET-9200
     
     
    Box 2:
    ET-10000
     
     
    Box 3:
    ET-8500
     
     
    Box 4:
    ET-8000
     
     
    Box 5:
    Gigablue Quad+
     
     
    Siehe hier:
    https://github.com/uzh-rpg/rpg_svo/issues/7

    Versuch mal in der site.conf das "-march=native" zu löschen oder so wie im Link beschrieben zu ändern.
    ET-10000, ET-9200, ET-8000, Gigablue Quad+

  8. Thanks killajoe bedankten sich
  9. #228
    Anfänger
    Registriert seit
    06.10.2015
    Beiträge
    10
    Total Downloaded
    0
    Total Downloaded
    0
    ReceiverDankeAktivitäten
    Box 1:
    GigaBlue HD Quad Plus
     
     
    Box 2:
    Dreambox DM800
     
     
    Box 3:
    GigaBlue HD X1
     
     
    Box 4:
    VDR-2.2.0
     
     
    Box 5:
    Humax PR-HD3000 (kompletter Müll ;-)
     
     
    Super, danke für den Link. Funktiert mit "-march=corei7" wunderbar.....

    Noch eine andere Frage: Gibt es eine Beschreibung, wie weitere Software ins Image integriert werden kann? Ich weiß nicht, ob das was zur Sache tut, aber mir liegt viel daran, "screen" auf der Box verfügbar zu haben....

  10. #229
    Avatar von betacentauri
    Registriert seit
    15.06.2013
    Beiträge
    1.347
    Total Downloaded
    1,32 MB
    Total Downloaded
    1,32 MB
    ReceiverDankeAktivitäten
    Box 1:
    ET-9200
     
     
    Box 2:
    ET-10000
     
     
    Box 3:
    ET-8500
     
     
    Box 4:
    ET-8000
     
     
    Box 5:
    Gigablue Quad+
     
     
    screen bitbake Datei gibt es schon. Damit hast du schon fast alles. Dann noch in die meta-oe-alliance/meta-oe/recipes-distros/openatv/image/openatv-image.bb unter IMAGE_INSTALL screen einfügen und es sollte beim nächsten Imagebau mit im Image sein.
    ET-10000, ET-9200, ET-8000, Gigablue Quad+

  11. Thanks killajoe bedankten sich
  12. #230
    Anfänger
    Registriert seit
    06.10.2015
    Beiträge
    10
    Total Downloaded
    0
    Total Downloaded
    0
    ReceiverDankeAktivitäten
    Box 1:
    GigaBlue HD Quad Plus
     
     
    Box 2:
    Dreambox DM800
     
     
    Box 3:
    GigaBlue HD X1
     
     
    Box 4:
    VDR-2.2.0
     
     
    Box 5:
    Humax PR-HD3000 (kompletter Müll ;-)
     
     
    Ah! Das ist ja ne super Sache!! Alles schon vorbereitet :-)
    Da stellt sich mir aber zeitgleich die Frage, warum ich "screen" ursprünglich nicht nachträglich mittles "opkg install screen" installieren konnte. Gibt es das Paket nicht im online Archiv / Paketverwaltung?

    Wie verhält sich das mit der Paketverwaltung überhaupt? Wenn ich selbst ein Image erstelle, muss ich dann zwangsläufig auch auf die selbst erstellten Pakete zurückgreifen? Oder geht auch das online Archiv?

    Und abschließend noch eine Frage (aller guten Dinge sind bekanntlich 3 ;-)) Wenn ich in der Build-Umgebung beispielsweise für screen die screen.bb ändere, wie schaffe ich es, dass das Paket neu erstellt wird? Was muss ich hierzu löschen oder ausführen? Im rootfs-Verzeichnis ändert sich nämlich nichts. Das Änderungdatum ist das selbe wie vor 2 Tagen. Wenn ich die Datei lösche, wird sie nicht neu erstellt. Ebenso, wenn ich im work-Verzeichnis den Ordner lösche.

    Sorry, Anfängerfragen, aber wie mir scheint, sehr elementar.....

    TIA!


Seite 23 von 38 ErsteErste ... 13212223242533 ... LetzteLetzte

Stichworte

Lesezeichen

Berechtigungen

  • Neue Themen erstellen: Nein
  • Themen beantworten: Nein
  • Anhänge hochladen: Nein
  • Beiträge bearbeiten: Nein
  •  
Diese Website benutzt Cookies
Wir benutzen Cookies um Sitzungsinformationen zu speichern. Dies erleichtert es uns z.B. Dich an Deine Login zu erinnern, Einstellungen der Webseite zu speichern, Inhalte und Werbung zu personalisieren, Social Media Funktionen anzubieten und unser Datenaufkommen zu analysieren. Wir teilen diese Informationen ebenfalls mit unseren Social Media-, Werbe- und Analysepartnern.
     
Alle Zeitangaben in WEZ +1. Es ist jetzt 17:43 Uhr.
Powered by vBulletin® Version 4.2.3 (Deutsch)
Copyright ©2017 Adduco Digital e.K. und vBulletin Solutions, Inc. Alle Rechte vorbehalten.
Resources saved on this page: MySQL 5,56%
Parts of this site powered by vBulletin Mods & Addons from DragonByte Technologies Ltd. (Details)
vBulletin Skin By: PurevB.com