Thanks Thanks:  110
Seite 19 von 38 ErsteErste ... 9171819202129 ... LetzteLetzte
Ergebnis 181 bis 190 von 372
  1. #181
    Mitglied
    Registriert seit
    02.10.2013
    Beiträge
    50
    Total Downloaded
    0
    Total Downloaded
    0
    ReceiverDankeAktivitäten
    Box 1:
    Golden Media Reloaded SPARK
     
     
    hi all

    How to update branch 2.3 to 2.4 for build image with kernel 217

    Do you re-load again branch 2.4

    thx
    Golden Media Reloaded SPARK Sti7111

    •   Alt Advertising

       

  2. #182
    Avatar von Captain
    Registriert seit
    03.04.2013
    Beiträge
    10.202
    Themenstarter
    Total Downloaded
    162,35 MB
    Total Downloaded
    162,35 MB
    ReceiverDankeAktivitäten
    yes must start clean and checkout git complete fresh dont forget switch branch to 2.4 before first build and make update to get correct submodules

  3. Thanks pop1234 bedankten sich
  4. #183
    Mitglied
    Registriert seit
    17.01.2014
    Beiträge
    64
    Total Downloaded
    363,2 KB
    Total Downloaded
    363,2 KB
    ReceiverDankeAktivitäten
    Is the firmware link from the first post still the most actual version?
    If not, where can I get the latest firmware?

  5. #184
    Anfänger
    Registriert seit
    26.02.2015
    Beiträge
    3
    Total Downloaded
    0
    Total Downloaded
    0
    ReceiverDankeAktivitäten
    Trying to build image for dm800se. Getting the below log error. The error will always happen when running task qemu_2.1.0.bb, do_compile. Need to rerun make image then only task will succeed. Any ideas? Thanks.

    Build Configuration:
    BB_VERSION = "1.23.1"
    BUILD_SYS = "x86_64-linux"
    NATIVELSBSTRING = "Ubuntu-14.04"
    TARGET_SYS = "mipsel-oe-linux"
    MACHINE = "dm800se"
    DISTRO = "openatv"
    DISTRO_VERSION = "4.2"
    TUNE_FEATURES = "o32 fpu-hard mips32"
    TARGET_FPU = ""
    meta = "(detachedfrom4321c55):4321c553d5ae816e566234e981a 0815bba046d39"
    meta-oe
    meta-multimedia
    meta-networking
    meta-filesystems
    meta-python = "(detachedfrom4d4ab8f):4d4ab8fd320b58323033c12cf70 5e7b3ce10d659"
    meta-oe
    meta-airdigital
    meta-azbox
    meta-blackbox
    meta-ceryon
    meta-cube
    meta-dags
    meta-dream
    meta-ebox
    meta-entwopia
    meta-formuler
    meta-fulan
    meta-gigablue
    meta-ini
    meta-ixuss
    meta-broadmedia
    meta-odin
    meta-skylake
    meta-tripledot
    meta-vuplus
    meta-xp
    meta-xtrend = "(detachedfrome3e565b):e3e565b4ee42ecadac696297133 e09decf3eb0e5"
    meta-local = "2.3:208cda908b7ac871c112f8ac263f9542b3b1df12"

    NOTE: Preparing runqueue
    NOTE: Executing SetScene Tasks
    NOTE: Executing RunQueue Tasks
    NOTE: Running task 1496 of 10127 (ID: 9563, virtual:native:/home/yaz/openatv/build-enviroment/openembedded-core/meta/recipes-devtools/qemu/qemu_2.1.0.bb, do_compile)
    NOTE: Running task 1726 of 10127 (ID: 6001, /home/yaz/openatv/build-enviroment/openembedded-core/meta/recipes-graphics/xorg-lib/libxv_1.0.10.bb, do_packagedata)
    NOTE: recipe qemu-native-2.1.0-r0: task do_compile: Started
    NOTE: recipe libxv-1.0.10-r0: task do_packagedata: Started
    NOTE: recipe libxv-1.0.10-r0: task do_packagedata: Succeeded
    NOTE: Running task 1727 of 10127 (ID: 6006, /home/yaz/openatv/build-enviroment/openembedded-core/meta/recipes-graphics/xorg-lib/libxv_1.0.10.bb, do_package_write_ipk)
    ERROR: Function failed: do_compile (log file is located at /home/yaz/openatv/build-enviroment/builds/openatv/dm800se/tmp/work/x86_64-linux/qemu-native/2.1.0-r0/temp/log.do_compile.23095)
    ERROR: Logfile of failure stored in: /home/yaz/openatv/build-enviroment/builds/openatv/dm800se/tmp/work/x86_64-linux/qemu-native/2.1.0-r0/temp/log.do_compile.23095
    NOTE: recipe qemu-native-2.1.0-r0: task do_compile: Failed
    ERROR: Task 9563 (virtual:native:/home/yaz/openatv/build-enviroment/openembedded-core/meta/recipes-devtools/qemu/qemu_2.1.0.bb, do_compile) failed with exit code '1'
    NOTE: recipe libxv-1.0.10-r0: task do_package_write_ipk: Started
    NOTE: recipe libxv-1.0.10-r0: task do_package_write_ipk: Succeeded
    NOTE: Tasks Summary: Attempted 1728 tasks of which 1725 didn't need to be rerun and 1 failed.

  6. #185
    Avatar von arn354
    Registriert seit
    06.04.2013
    Beiträge
    2.590
    Total Downloaded
    147,3 KB
    Total Downloaded
    147,3 KB
    ReceiverDankeAktivitäten
    Check for error in /home/yaz/openatv/build-enviroment/builds/openatv/dm800se/tmp/work/x86_64-linux/qemu-native/2.1.0-r0/temp/log.do_compile.23095

    Probably a dependency issue that something is not build yet that qemu-native needs.

    Local computers are usually slower then powerful buildservers. A buildserver compiles stuff much quicker (probably more tasks available to run in parallel) - so no one gets this issue.
    Geändert von arn354 (26.02.2015 um 05:37 Uhr)
    Grüßle


  7. Thanks kreator bedankten sich
  8. #186
    Anfänger
    Registriert seit
    18.07.2014
    Beiträge
    3
    Total Downloaded
    0
    Total Downloaded
    0
    ReceiverDankeAktivitäten
    hi all

    error build MACHINE=sparkreloaded DISTRO=openatv make image

    Parsing recipes: 100% |#########################################| Time: 00:02:10
    Parsing of 2646 .bb files complete (0 cached, 2646 parsed). 3157 targets, 110 skipped, 0 masked, 0 errors.
    WARNING: No bb files matched BBFILE_PATTERN_local-layer '^/home/youssef/Bureau/spark/build-enviroment/meta-local/'
    NOTE: Resolving any missing task queue dependencies

    Build Configuration:
    BB_VERSION = "1.25.0"
    BUILD_SYS = "x86_64-linux"
    NATIVELSBSTRING = "Ubuntu-14.04"
    TARGET_SYS = "sh4-oe-linux"
    MACHINE = "spark"
    DISTRO = "openatv"
    DISTRO_VERSION = "4.3"
    TUNE_FEATURES = "sh4"
    meta = "(detachedfrom219e793):219e793907406eabf632e784e3a 11ab9acb77cfb"
    meta-oe
    meta-multimedia
    meta-networking
    meta-filesystems
    meta-python = "(detachedfrom2cc1bd9):2cc1bd9dd060f5002c2fde7aacb a86fe230c12af"
    meta-oe
    meta-airdigital
    meta-azbox
    meta-blackbox
    meta-ceryon
    meta-cube
    meta-dags
    meta-dream
    meta-ebox
    meta-entwopia
    meta-formuler
    meta-fulan
    meta-gigablue
    meta-ini
    meta-ixuss
    meta-broadmedia
    meta-odin
    meta-skylake
    meta-tripledot
    meta-vuplus
    meta-xp
    meta-xtrend = "(detachedfrom4439538):443953866e45cc544b9b80d0952 6f79fd3f84008"
    meta-local = "<unknown>:<unknown>"

    NOTE: Preparing RunQueue
    NOTE: Executing SetScene Tasks
    NOTE: Executing RunQueue Tasks
    ERROR: Function failed: Fetcher failure: Fetch command failed with exit code 128, output:
    fatal: repository '/home/youssef/Bureau/spark/build-enviroment/sources/git2/git.stlinux.com.stm.linux-sh4-2.6.32.y.git/' does not exist

    ERROR: Logfile of failure stored in: /home/youssef/Bureau/spark/build-enviroment/builds/openatv/spark/tmp/work/spark-oe-linux/linux-fulan/2.6.32-r1.27/temp/log.do_unpack.28637
    Log data follows:
    | DEBUG: Executing python function do_unpack
    | DEBUG: Executing python function base_do_unpack
    | DEBUG: Running export PATH="/home/youssef/Bureau/spark/build-enviroment/openembedded-core/scripts:/home/youssef/Bureau/spark/build-enviroment/builds/openatv/spark/tmp/sysroots/x86_64-linux/usr/bin/sh4-oe-linux:/home/youssef/Bureau/spark/build-enviroment/builds/openatv/spark/tmp/sysroots/spark/usr/bin/crossscripts:/home/youssef/Bureau/spark/build-enviroment/builds/openatv/spark/tmp/sysroots/x86_64-linux/usr/sbin:/home/youssef/Bureau/spark/build-enviroment/builds/openatv/spark/tmp/sysroots/x86_64-linux/usr/bin:/home/youssef/Bureau/spark/build-enviroment/builds/openatv/spark/tmp/sysroots/x86_64-linux/sbin:/home/youssef/Bureau/spark/build-enviroment/builds/openatv/spark/tmp/sysroots/x86_64-linux/bin:/home/youssef/Bureau/spark/build-enviroment/openembedded-core/scripts:/home/youssef/Bureau/spark/build-enviroment/bitbake/bin:/usr/local/sbin:/usr/local/bin:/usr/sbin:/usr/bin:/sbin:/bin:/usr/games:/usr/local/games"; export HOME="/home/youssef"; git -c core.fsyncobjectfiles=0 clone -s -n /home/youssef/Bureau/spark/build-enviroment/sources/git2/git.stlinux.com.stm.linux-sh4-2.6.32.y.git/ /home/youssef/Bureau/spark/build-enviroment/builds/openatv/spark/tmp/work/spark-oe-linux/linux-fulan/2.6.32-r1.27/git/
    | DEBUG: Python function base_do_unpack finished
    | DEBUG: Python function do_unpack finished
    | ERROR: Function failed: Fetcher failure: Fetch command failed with exit code 128, output:
    | fatal: repository '/home/youssef/Bureau/spark/build-enviroment/sources/git2/git.stlinux.com.stm.linux-sh4-2.6.32.y.git/' does not exist
    |
    ERROR: Task 76 (/home/youssef/Bureau/spark/build-enviroment/meta-oe-alliance/meta-brands/meta-fulan/recipes-linux/linux-fulan_2.6.32.bb, do_unpack) failed with exit code '1'
    NOTE: Tasks Summary: Attempted 3148 tasks of which 0 didn't need to be rerun and 1 failed.
    Waiting for 0 running tasks to finish:

    Summary: 1 task failed:
    /home/youssef/Bureau/spark/build-enviroment/meta-oe-alliance/meta-brands/meta-fulan/recipes-linux/linux-fulan_2.6.32.bb, do_unpack
    Summary: There were 66 WARNING messages shown.
    Summary: There was 1 ERROR message shown, returning a non-zero exit code.
    make: *** [image] Erreur 1
    youssef@youssef-Inspiron-N4050:~/Bureau/spark/build-enviroment$

  9. #187
    Avatar von Captain
    Registriert seit
    03.04.2013
    Beiträge
    10.202
    Themenstarter
    Total Downloaded
    162,35 MB
    Total Downloaded
    162,35 MB
    ReceiverDankeAktivitäten
    fatal: repository '/home/youssef/Bureau/spark/build-enviroment/sources/git2/git.stlinux.com.stm.linux-sh4-2.6.32.y.git/' does not exist

    looks you have change any local

  10. #188
    Anfänger
    Registriert seit
    26.02.2015
    Beiträge
    3
    Total Downloaded
    0
    Total Downloaded
    0
    ReceiverDankeAktivitäten
    Zitat Zitat von arn354 Beitrag anzeigen
    Check for error in /home/yaz/openatv/build-enviroment/builds/openatv/dm800se/tmp/work/x86_64-linux/qemu-native/2.1.0-r0/temp/log.do_compile.23095

    Probably a dependency issue that something is not build yet that qemu-native needs.

    Local computers are usually slower then powerful buildservers. A buildserver compiles stuff much quicker (probably more tasks available to run in parallel) - so no one gets this issue.
    Thanks for the reply. Below is the log.do_compile.23095. Everytime the task run.do_compile in the qemu-native need to be run twice to succeed.

    DEBUG: Executing shell function do_compile
    NOTE: make -j 2
    LINK mips64el-softmmu/qemu-system-mips64el
    target-mips/translate.o: file not recognized: File truncated
    collect2: error: ld returned 1 exit status
    make[1]: *** [qemu-system-mips64el] Error 1
    make: *** [subdir-mips64el-softmmu] Error 2
    make: *** Waiting for unfinished jobs....
    LINK mips64-softmmu/qemu-system-mips64
    target-mips/translate.o: file not recognized: File truncated
    collect2: error: ld returned 1 exit status
    make[1]: *** [qemu-system-mips64] Error 1
    make: *** [subdir-mips64-softmmu] Error 2
    ERROR: oe_runmake failed
    WARNING: /home/yaz/openatv/build-enviroment/builds/openatv/dm800se/tmp/work/x86_64-linux/qemu-native/2.1.0-r0/temp/run.do_compile.23095:1 exit 1 from
    exit 1
    ERROR: Function failed: do_compile (log file is located at /home/yaz/openatv/build-enviroment/builds/openatv/dm800se/tmp/work/x86_64-linux/qemu-native/2.1.0-r0/temp/log.do_compile.23095)

  11. #189
    Anfänger
    Registriert seit
    26.02.2015
    Beiträge
    3
    Total Downloaded
    0
    Total Downloaded
    0
    ReceiverDankeAktivitäten
    Would there be any difference using ubuntu 12.04? Having a lot of compiling error for dm800se on Ubuntu 14.04. Always need to rerun.

  12. #190
    Anfänger
    Registriert seit
    21.07.2014
    Beiträge
    23
    Total Downloaded
    0
    Total Downloaded
    0
    ReceiverDankeAktivitäten
    2 short questions:
    How can I activate additional plugins/addons when building the image?
    And is it possible to store some initial settings already in /etc/enigma2/settings? I would like to add the autostart of OSCam already during the building process. I tried to add some line to /etc/enigma2/settings with the postinst-instructions of my oscam-package, but /etc/enigma2/settings is not included in the built image...


Seite 19 von 38 ErsteErste ... 9171819202129 ... LetzteLetzte

Stichworte

Lesezeichen

Berechtigungen

  • Neue Themen erstellen: Nein
  • Themen beantworten: Nein
  • Anhänge hochladen: Nein
  • Beiträge bearbeiten: Nein
  •  
Diese Website benutzt Cookies
Wir benutzen Cookies um Sitzungsinformationen zu speichern. Dies erleichtert es uns z.B. Dich an Deine Login zu erinnern, Einstellungen der Webseite zu speichern, Inhalte und Werbung zu personalisieren, Social Media Funktionen anzubieten und unser Datenaufkommen zu analysieren. Wir teilen diese Informationen ebenfalls mit unseren Social Media-, Werbe- und Analysepartnern.
     
Alle Zeitangaben in WEZ +1. Es ist jetzt 18:13 Uhr.
Powered by vBulletin® Version 4.2.3 (Deutsch)
Copyright ©2017 Adduco Digital e.K. und vBulletin Solutions, Inc. Alle Rechte vorbehalten.
Resources saved on this page: MySQL 5,56%
Parts of this site powered by vBulletin Mods & Addons from DragonByte Technologies Ltd. (Details)
vBulletin Skin By: PurevB.com