Thanks Thanks:  110
Seite 16 von 38 ErsteErste ... 6141516171826 ... LetzteLetzte
Ergebnis 151 bis 160 von 372
  1. #151

    Registriert seit
    25.05.2014
    Beiträge
    17
    Total Downloaded
    0
    Total Downloaded
    0
    ReceiverDankeAktivitäten
    Zitat Zitat von comag Beitrag anzeigen
    Leider habe ich diesen Fehler

    Code:
    | make[3]: Entering directory `/home/tas/openatv/build-enviroment/builds/openatv/spark/tmp/work/sh4-oe-linux/netatalk/2.2.3-4/build/etc/afpd'
    | ../../sh4-oe-linux-libtool  --tag=CC   --mode=link sh4-oe-linux-gcc  -ml -m4 --sysroot=/home/tas/openatv/build-enviroment/builds/openatv/spark/tmp/sysroots/spark -std=gnu99 -I/home/tas/openatv/build-enviroment/builds/openatv/spark/tmp/work/sh4-oe-linux/netatalk/2.2.3-4/netatalk-2.2.3/include -I/home/tas/openatv/build-enviroment/builds/openatv/spark/tmp/work/sh4-oe-linux/netatalk/2.2.3-4/netatalk-2.2.3/sys -D_REENTRANT -DAPPLCNAME -DSERVERTEXT=\"/etc/netatalk/msg/\" -D_PATH_AFPDDEFVOL=\"/etc/netatalk/AppleVolumes.default\" -D_PATH_AFPDSYSVOL=\"/etc/netatalk/AppleVolumes.system\" -D_PATH_AFPDPWFILE=\"/etc/netatalk/afppasswd\" -D_PATH_AFPDCONF=\"/etc/netatalk/afpd.conf\" -D_PATH_AFPDSIGCONF=\"/etc/netatalk/afp_signature.conf\" -D_PATH_AFPDUAMPATH=\"/etc/netatalk/uams/\" -D_PATH_ACL_LDAPCONF=\"/etc/netatalk/afp_ldap.conf\" -D_PATH_AFPDUUIDCONF=\"/etc/netatalk/afp_voluuid.conf\" -I/home/tas/openatv/build-enviroment/builds/openatv/spark/tmp/work/sh4-oe-linux/netatalk/2.2.3-4/netatalk-2.2.3/include -D_U_="__attribute__((unused))"  -Os -pipe -g -feliminate-unused-debug-types -I/home/tas/openatv/build-enviroment/builds/openatv/spark/tmp/work/sh4-oe-linux/netatalk/2.2.3-4/netatalk-2.2.3/sys -export-dynamic  -Wl,-O1 -Wl,--hash-style=gnu -Wl,--as-needed -lpthread -L/home/tas/openatv/build-enviroment/builds/openatv/spark/tmp/sysroots/spark/usr/lib -o afpd afpd-afp_asp.o afpd-afp_avahi.o afpd-afp_config.o afpd-afp_dsi.o afpd-afp_mdns.o afpd-afp_options.o afpd-afp_util.o afpd-afp_zeroconf.o afpd-afprun.o afpd-afs.o afpd-appl.o afpd-auth.o afpd-catsearch.o afpd-desktop.o afpd-dircache.o afpd-directory.o afpd-enumerate.o afpd-extattrs.o afpd-fce_api.o afpd-fce_util.o afpd-file.o afpd-filedir.o afpd-fork.o afpd-gettok.o afpd-hash.o afpd-main.o afpd-mangle.o afpd-messages.o afpd-nfsquota.o afpd-ofork.o afpd-quota.o afpd-status.o afpd-switch.o afpd-uam.o afpd-uid.o afpd-unix.o afpd-volume.o afpd-acls.o ../../libatalk/cnid/libcnid.la ../../libatalk/libatalk.la -L/lib/x86_64-linux-gnu -lgcrypt  -lavahi-common -lavahi-client   -lwrap -ldl   -lacl -lattr -lpthread -lpthread -ldl  -L/home/tas/openatv/build-enviroment/builds/openatv/spark/tmp/work/sh4-oe-linux/netatalk/2.2.3-4/netatalk-2.2.3/libatalk
    | sh4-oe-linux-libtool: link: sh4-oe-linux-gcc -ml -m4 --sysroot=/home/tas/openatv/build-enviroment/builds/openatv/spark/tmp/sysroots/spark -std=gnu99 -I/home/tas/openatv/build-enviroment/builds/openatv/spark/tmp/work/sh4-oe-linux/netatalk/2.2.3-4/netatalk-2.2.3/include -I/home/tas/openatv/build-enviroment/builds/openatv/spark/tmp/work/sh4-oe-linux/netatalk/2.2.3-4/netatalk-2.2.3/sys -D_REENTRANT -DAPPLCNAME -DSERVERTEXT=\"/etc/netatalk/msg/\" -D_PATH_AFPDDEFVOL=\"/etc/netatalk/AppleVolumes.default\" -D_PATH_AFPDSYSVOL=\"/etc/netatalk/AppleVolumes.system\" -D_PATH_AFPDPWFILE=\"/etc/netatalk/afppasswd\" -D_PATH_AFPDCONF=\"/etc/netatalk/afpd.conf\" -D_PATH_AFPDSIGCONF=\"/etc/netatalk/afp_signature.conf\" -D_PATH_AFPDUAMPATH=\"/etc/netatalk/uams/\" -D_PATH_ACL_LDAPCONF=\"/etc/netatalk/afp_ldap.conf\" -D_PATH_AFPDUUIDCONF=\"/etc/netatalk/afp_voluuid.conf\" -I/home/tas/openatv/build-enviroment/builds/openatv/spark/tmp/work/sh4-oe-linux/netatalk/2.2.3-4/netatalk-2.2.3/include "-D_U_=__attribute__((unused))" -Os -pipe -g -feliminate-unused-debug-types -I/home/tas/openatv/build-enviroment/builds/openatv/spark/tmp/work/sh4-oe-linux/netatalk/2.2.3-4/netatalk-2.2.3/sys -Wl,-O1 -Wl,--hash-style=gnu -Wl,--as-needed -o afpd afpd-afp_asp.o afpd-afp_avahi.o afpd-afp_config.o afpd-afp_dsi.o afpd-afp_mdns.o afpd-afp_options.o afpd-afp_util.o afpd-afp_zeroconf.o afpd-afprun.o afpd-afs.o afpd-appl.o afpd-auth.o afpd-catsearch.o afpd-desktop.o afpd-dircache.o afpd-directory.o afpd-enumerate.o afpd-extattrs.o afpd-fce_api.o afpd-fce_util.o afpd-file.o afpd-filedir.o afpd-fork.o afpd-gettok.o afpd-hash.o afpd-main.o afpd-mangle.o afpd-messages.o afpd-nfsquota.o afpd-ofork.o afpd-quota.o afpd-status.o afpd-switch.o afpd-uam.o afpd-uid.o afpd-unix.o afpd-volume.o afpd-acls.o -Wl,--export-dynamic  -L/home/tas/openatv/build-enviroment/builds/openatv/spark/tmp/sysroots/spark/usr/lib ../../libatalk/cnid/.libs/libcnid.a -L/home/tas/openatv/build-enviroment/builds/openatv/spark/tmp/work/sh4-oe-linux/netatalk/2.2.3-4/netatalk-2.2.3/libatalk ../../libatalk/.libs/libatalk.a -L/lib/x86_64-linux-gnu /home/tas/openatv/build-enviroment/builds/openatv/spark/tmp/sysroots/spark/usr/lib/libgcrypt.so /home/tas/openatv/build-enviroment/builds/openatv/spark/tmp/sysroots/spark/usr/lib/libgpg-error.so -lcap /home/tas/openatv/build-enviroment/builds/openatv/spark/tmp/sysroots/spark/usr/lib/libavahi-client.so /home/tas/openatv/build-enviroment/builds/openatv/spark/tmp/sysroots/spark/usr/lib/libdbus-1.so /home/tas/openatv/build-enviroment/builds/openatv/spark/tmp/sysroots/spark/usr/lib/libavahi-common.so -lwrap /home/tas/openatv/build-enviroment/builds/openatv/spark/tmp/sysroots/spark/usr/lib/libacl.so /home/tas/openatv/build-enviroment/builds/openatv/spark/tmp/sysroots/spark/usr/lib/libattr.so -lpthread -ldl -pthread
    | /home/tas/openatv/build-enviroment/builds/openatv/spark/tmp/sysroots/x86_64-linux/usr/libexec/sh4-oe-linux/gcc/sh4-oe-linux/4.8.2/ld: warning: library search path "/lib/x86_64-linux-gnu" is unsafe for cross-compilation
    | /lib/x86_64-linux-gnu/libgcc_s.so.1: file not recognized: File format not recognized
    | collect2: error: ld returned 1 exit status
    | make[3]: *** [afpd] Error 1
    | make[3]: Leaving directory `/home/tas/openatv/build-enviroment/builds/openatv/spark/tmp/work/sh4-oe-linux/netatalk/2.2.3-4/build/etc/afpd'
    | make[2]: *** [all-recursive] Error 1
    | make[2]: Leaving directory `/home/tas/openatv/build-enviroment/builds/openatv/spark/tmp/work/sh4-oe-linux/netatalk/2.2.3-4/build/etc'
    | make[1]: *** [all-recursive] Error 1
    | make[1]: Leaving directory `/home/tas/openatv/build-enviroment/builds/openatv/spark/tmp/work/sh4-oe-linux/netatalk/2.2.3-4/build'
    | make: *** [all] Error 2
    | ERROR: oe_runmake failed
    | WARNING: /home/tas/openatv/build-enviroment/builds/openatv/spark/tmp/work/sh4-oe-linux/netatalk/2.2.3-4/temp/run.do_compile.12535:1 exit 1 from
    |   exit 1
    | ERROR: Function failed: do_compile (log file is located at /home/tas/openatv/build-enviroment/builds/openatv/spark/tmp/work/sh4-oe-linux/netatalk/2.2.3-4/temp/log.do_compile.12535)
    ERROR: Task 3662 (/home/tas/openatv/build-enviroment/meta-oe-alliance/meta-oe/recipes-connectivity/netatalk/netatalk_2.2.3.bb, do_compile) failed with exit code '1'
    NOTE: Tasks Summary: Attempted 9414 tasks of which 9405 didn't need to be rerun and 1 failed.
    Waiting for 0 running tasks to finish:
    
    Summary: 1 task failed:
      /home/tas/openatv/build-enviroment/meta-oe-alliance/meta-oe/recipes-connectivity/netatalk/netatalk_2.2.3.bb, do_compile
    Summary: There were 46 WARNING messages shown.
    Summary: There was 1 ERROR message shown, returning a non-zero exit code.
    make: *** [image] Błąd 1
    tas@LINUX:~/openatv/build-enviroment$
    This error is most probably caused by libgcrypt-dev package installed on your build host. This is detected during configure step and later on netatalk tries to link against. Here is a patch to solve this. I am not sure if libgcrypt is needed...

    From 4f288626e981aa696e121d75842f2a0e811cbe24 Mon Sep 17 00:00:00 2001
    From: Christian Ege <k4230r6@gmail.com>
    Date: Fri, 14 Nov 2014 21:18:50 +0100
    Subject: [PATCH] Fixes for installation of libgcrypt on build host


    If the build host have the gcrypt library installed netatalk tries to link
    against which results in a openembedded error because linking against host
    libraries is prohibited.


    [...]
    sh4-oe-linux/4.8.2/ld: warning: library search path "/lib/x86_64-linux-gnu" is unsafe for cross-compilation
    | /lib/x86_64-linux-gnu/libgcc_s.so.1: file not recognized: File format not recognized
    [...]


    The second fix removes an error about installed and not shiped static library
    the solution is to add the staticdev package to PACKAGES.


    Signed-off-by: Christian Ege <k4230r6@gmail.com>
    ---
    .../netatalk/netatalk_2.2.3.bb | 10 ++++++----
    1 file changed, 6 insertions(+), 4 deletions(-)


    diff --git a/meta-oe/recipes-connectivity/netatalk/netatalk_2.2.3.bb b/meta-oe/recipes-connectivity/netatalk/netatalk_2.2.3.bb
    index 2c285e9..3f353a7 100644
    --- a/meta-oe/recipes-connectivity/netatalk/netatalk_2.2.3.bb
    +++ b/meta-oe/recipes-connectivity/netatalk/netatalk_2.2.3.bb
    @@ -3,7 +3,7 @@ PR = "4"

    require conf/license/license-gplv2.inc

    -DEPENDS = "cups db openssl"
    +DEPENDS = "cups db openssl libgcrypt"

    SRC_URI = "${SOURCEFORGE_MIRROR}/project/netatalk/netatalk/${PV}/netatalk-${PV}.tar.gz;name=src \
    file://netatalk.conf \
    @@ -17,7 +17,7 @@ inherit autotools pkgconfig update-rc.d
    INITSCRIPT_NAME = "atalk"
    INITSCRIPT_PARAMS = "defaults 20"

    -PACKAGES = "${PN}-atalkd ${PN}-pap ${PN}-timelord ${PN}-dbg ${PN} ${PN}-doc ${PN}-dev"
    +PACKAGES = "${PN}-atalkd ${PN}-pap ${PN}-timelord ${PN}-dbg ${PN} ${PN}-doc ${PN}-dev ${PN}-staticdev"

    INSANE_SKIP_${PN} = "dev-so"

    @@ -31,7 +31,7 @@ FILES_${PN}-pap += "/usr/bin/pap \
    /usr/bin/papstatus"
    FILES_${PN}-timelord += "/usr/sbin/timelord"
    FILES_${PN}-dbg += "${sysconfdir}/netatalk/uams/.debug"
    -FILES_${PN}-staticdev += "${libdir}/.a"
    +FILES_${PN}-staticdev += "${libdir}/*.a"

    # FILES_${PN} += "${sysconfdir}/netatalk/uams/uams_clrtxt.so \
    # ${sysconfdir}/netatalk/uams/uams_dhx2.so \
    @@ -45,7 +45,9 @@ EXTRA_OECONF += "ac_cv_path_KRB5_CONFIG=no \
    --enable-static=no \
    --disable-srvloc \
    --without-pam \
    - --with-ssl-dir=${STAGING_DIR_TARGET}${prefix_native}"
    + --with-ssl-dir=${STAGING_DIR_TARGET}${prefix_native} \
    + --with-libgcrypt-dir=${STAGING_DIR_TARGET}${prefix_native}\
    +"
    LDFLAGS += "-lpthread -L${STAGING_LIBDIR}"

    do_install_append() {
    --
    1.7.9.5

    •   Alt Advertising

       

  2. #152
    Anfänger
    Registriert seit
    08.10.2014
    Beiträge
    3
    Total Downloaded
    11,46 MB
    Total Downloaded
    11,46 MB
    ReceiverDankeAktivitäten
    Box 1:
    Nokia dbox1
     
     
    Ich habe dank der Anleitung jetzt auch mal selber ein Image kompiliert, für die Gigablue 800 SE Plus (ohne die SH4-Extras natürlich); das Paket libproc-processtable-perl hatte bei mir auch gefehlt und ebenfalls musste ich den Eintrag für OpenSSL ändern.

    Jetzt bin ich anscheinend an derselben Stelle wie /dev/null - ich habe ein Testrezept in einem neuen Unterordner von meta-local/recipes-local erstellt (s.u.). "make image" hatte dann erstmal gemeckert, weil im Rezept LICENSE gefehlt hat. Nach der Korrektur wird bis jetzt aber das Rezept leider ignoriert, egal was ich versuche (habe auch mal SECTION oder eine andere Lizenz ausprobiert - hilft nix). Habe extra echos eingebaut, die in do_compile und do_install dann Testdateien erstellen, damit man sieht, dass diese Funktionen überhaupt gelaufen sind. Sie werden aber trotzdem nicht ausgeführt. So langsam bin ich mit meinem Latein am Ende.

    So sieht meine sphelloworld.bb aus:

    Code:
    DESCRIPTION = "Testrezept für Hello world"
    #SECTION = "apps"
    #LICENSE = "PD"
    PR = "r7"
    
    SRC_URI = "file://sphelloworld.c"
    
    RM_WORK_EXCLUDE += "sphelloworld"
    S = "${WORKDIR}"
    
    do_compile() {
        echo compile bla1 > /home/stefan/compile.txt
        ${CC} ${CFLAGS} ${LDFLAGS} sphelloworld.c -o sphelloworld
        echo compile bla2 > /home/stefan/compile.txt
    }
    
    do_install() {
        echo install bla1 > /home/stefan/install.txt
    #    install -m 0755 -d ${D}${bindir} ${D}${docdir}/hello2
    
    #    install -m 0755 -d ${D}${bindir}/
    #    install -m 0644 ${S}/sphelloworld ${D}${bindir}/
    
    #    install -m 0644 ${WORKDIR}/README.txt ${D}${docdir}/hello2
    
        install -d ${D}/${bindir}/
        install -m 0755 ${S}/sphelloworld ${D}/${bindir}/
    
        echo install bla2 > /home/stefan/install.txt
    }
    Im Endeffekt wollte ich ein paar Libraries und eine Anwendung kompilieren. Wenn das irgendwie mit der cross-compile-Toolchain klappt, die anscheinend mitkompiliert wird, wäre mir das auch Recht. Allerdings klappt damit (gcc) selbst ein billiges Hello World nicht. Beim Ausführen meckert er erstmal über eine fehlende Lib "ts" (hatte in C aber nur stdio.h eingebunden):

    Code:
    ./sphelloworld: error while loading shared libraries: ts: cannot open shared object file: No such file or directory
    Mit "-static" wird die Datei erwartungsgemäßig wesentlich größer (2 MB) - dafür kommt jetzt "Illegal instruction". "file" liefert bei diesem Binary und einem anderen schon vorhandenen (z.B. showiframe) allerdings denselben CPU-Typen zurück, so dass ich das nicht verstehe.

    Edit:
    Das Problem mit der Toolchain hat sich erledigt: Die Binaries hatte ich per FTP übertragen und FileZilla hat sie im Auto-Modus im ASCII-Format statt binär übertragen. -.-
    Geändert von Basic.Master (18.11.2014 um 15:16 Uhr)

  3. Thanks Lizard bedankten sich
  4. #153
    Anfänger
    Registriert seit
    08.10.2014
    Beiträge
    3
    Total Downloaded
    11,46 MB
    Total Downloaded
    11,46 MB
    ReceiverDankeAktivitäten
    Box 1:
    Nokia dbox1
     
     
    So, das eigentliche Problem habe ich jetzt auch gelöst. Ich dachte bis jetzt, durch die Layers-Geschichte würde bitbake einfach alle Rezepte kompilieren, die er in meta-local findet und die die Wildcards in BBFILES erfüllen, weil er die Rezepte dort jedenfalls parst. Aber anscheinend dient der Ordner als "override", sprich: bitbake sucht benötigte Rezepte zuerst dort (wegen der höheren BBFILE_PRIORITY) und benutzt sie dann anstelle des Originalrezepts. Deswegen wollte er mein Testrezept auch gar nicht ins Image packen, weil es natürlich nirgendwo referenziert war (ein direkter Aufruf von bitbake mit dem Rezept hatte zumindest schon mal geklappt).

    Habe den Rezeptnamen jetzt bei RDEPENDS_${PN} in der meta-oe-alliance/meta-oe/recipes-oe-alliance/image/oe-alliance-base.bb ergänzt und das Rezept wird nun bei der Imageerstellung beachtet.

  5. Thanks Bretterknaller bedankten sich
  6. #154
    Anfänger
    Registriert seit
    08.10.2014
    Beiträge
    3
    Total Downloaded
    11,46 MB
    Total Downloaded
    11,46 MB
    ReceiverDankeAktivitäten
    Box 1:
    Nokia dbox1
     
     
    ...und es geht noch eleganter, ohne die anderen Layer verändern zu müssen:

    Man erstellt einfach die neue Datei meta-local/recipes-oe-alliance/image/oe-alliance-base.bbappend, mit folgender Zeile:
    Code:
    RDEPENDS_${PN} += "package-name"

  7. Thanks Bretterknaller, graugans bedankten sich
  8. #155
    Anfänger
    Registriert seit
    21.07.2014
    Beiträge
    23
    Total Downloaded
    0
    Total Downloaded
    0
    ReceiverDankeAktivitäten

    Speicherort der fertigen packages festlegen

    Hallo,

    nur eine kurze Frage: Wie bzw. durch welche Variable wird definiert, wo die fertigen packages später landen? Letztlich werden sie unter openatv\build-enviroment\builds\openatv\spark\tmp\deploy\ipk in die Ordner
    • 3rdparty
    • all
    • sh4
    • spark
    • spark_3rdparty
    • sparkreloaded

    einsortiert. Wie kann ich es erreichen, dass meine packages z.B. in einem neuem Ordner "custom" landen?

    Danke und Gruß!

  9. #156
    Anfänger
    Registriert seit
    22.10.2014
    Beiträge
    17
    Total Downloaded
    9,83 MB
    Total Downloaded
    9,83 MB
    ReceiverDankeAktivitäten
    Hallo
    Gesundes neues Jahr wünsche ich euch.

    so nun habe ich meine Hardware mal aufgerüstet und wollte mich wieder ins Getümmel stürzen mußte leider einiges neu aufsetzen jetzt habe ich ein fehler.

    DEBUG: Executing shell function do_compile
    | Skipping source file '/media/andy/imagebau/imagebauop/openatv/build-enviroment/builds/openatv/spark7162/tmp/work/sognotriple-oe-linux/enigma2-plugin-extensions-openwebif/1+gitAUTOINC+84facd06ca-r0/git/plugin', not found.
    | Listing /media/andy/imagebau/imagebauop/openatv/build-enviroment/builds/openatv/spark7162/tmp/work/sognotriple-oe-linux/enigma2-plugin-extensions-openwebif/1+gitAUTOINC+84facd06ca-r0/git ...
    | /media/andy/imagebau/imagebauop/openatv/build-enviroment/builds/openatv/spark7162/tmp/work/sognotriple-oe-linux/enigma2-plugin-extensions-openwebif/1+gitAUTOINC+84facd06ca-r0/temp/run.do_compile.23251: 101: /media/andy/imagebau/imagebauop/openatv/build-enviroment/builds/openatv/spark7162/tmp/work/sognotriple-oe-linux/enigma2-plugin-extensions-openwebif/1+gitAUTOINC+84facd06ca-r0/temp/run.do_compile.23251: pushd: not found
    | WARNING: exit code 127 from a shell command.
    | ERROR: Function failed: do_compile (log file is located at /media/andy/imagebau/imagebauop/openatv/build-enviroment/builds/openatv/spark7162/tmp/work/sognotriple-oe-linux/enigma2-plugin-extensions-openwebif/1+gitAUTOINC+84facd06ca-r0/temp/log.do_compile.23251)
    ERROR: Task 5006 (/media/andy/imagebau/imagebauop/openatv/build-enviroment/meta-oe-alliance/meta-oe/recipes-oe-alliance/enigma2-plugins/enigma2-plugin-extensions-openwebif.bb, do_compile) failed with exit code '1'

    git/plugin', not found.


    ist auch wirklich nicht da


    kann mir einer helfen was damit ist

    serverandy

  10. #157
    Avatar von Captain
    Registriert seit
    03.04.2013
    Beiträge
    10.202
    Themenstarter
    Total Downloaded
    162,35 MB
    Total Downloaded
    162,35 MB
    ReceiverDankeAktivitäten
    pushd: not found

    use bash as shelll pushd is a builin command of bash

  11. #158
    Anfänger
    Registriert seit
    22.10.2014
    Beiträge
    17
    Total Downloaded
    9,83 MB
    Total Downloaded
    9,83 MB
    ReceiverDankeAktivitäten
    hallo
    viele dank für die schnelle antwort

    hatte wohl von der ersten seite noch was vergessen aber der will immer noch nicht


    DEBUG: Executing shell function do_install
    | cp: cannot stat '/media/andy/imagebau/imagebauop/openatv/build-enviroment/builds/openatv/spark7162/tmp/work/sognotriple-oe-linux/enigma2-plugin-extensions-openwebif/1+gitAUTOINC+84facd06ca-r0/git/plugin/*': No such file or directory
    | WARNING: /media/andy/imagebau/imagebauop/openatv/build-enviroment/builds/openatv/spark7162/tmp/work/sognotriple-oe-linux/enigma2-plugin-extensions-openwebif/1+gitAUTOINC+84facd06ca-r0/temp/run.do_install.12393:1 exit 1 from
    | cp -rp /media/andy/imagebau/imagebauop/openatv/build-enviroment/builds/openatv/spark7162/tmp/work/sognotriple-oe-linux/enigma2-plugin-extensions-openwebif/1+gitAUTOINC+84facd06ca-r0/git/plugin/* /media/andy/imagebau/imagebauop/openatv/build-enviroment/builds/openatv/spark7162/tmp/work/sognotriple-oe-linux/enigma2-plugin-extensions-openwebif/1+gitAUTOINC+84facd06ca-r0/image/usr/lib/enigma2/python/Plugins/Extensions/OpenWebif
    | ERROR: Function failed: do_install (log file is located at /media/andy/imagebau/imagebauop/openatv/build-enviroment/builds/openatv/spark7162/tmp/work/sognotriple-oe-linux/enigma2-plugin-extensions-openwebif/1+gitAUTOINC+84facd06ca-r0/temp/log.do_install.12393)


    kannst du mir das genauer erklären

    serverandy

  12. #159
    Avatar von madie
    Registriert seit
    05.04.2013
    Beiträge
    7.934
    Total Downloaded
    289,07 MB
    Total Downloaded
    289,07 MB
    ReceiverDankeAktivitäten
    Box 1:
    AX HD51
     
     
    lies dir mal den eingangspost durch:

    Set your shell to /bin/bash.
    sudo dpkg-reconfigure dash
    When asked: Install dash as /bin/sh?
    select "NO"

  13. #160
    Anfänger
    Registriert seit
    22.10.2014
    Beiträge
    17
    Total Downloaded
    9,83 MB
    Total Downloaded
    9,83 MB
    ReceiverDankeAktivitäten
    Habe ich so eingestellt kann es sein das ich von neuen beginnen muss ?
    oder liegt das an mein 14.04 ubuntu ?
    serverandy


Seite 16 von 38 ErsteErste ... 6141516171826 ... LetzteLetzte

Stichworte

Lesezeichen

Berechtigungen

  • Neue Themen erstellen: Nein
  • Themen beantworten: Nein
  • Anhänge hochladen: Nein
  • Beiträge bearbeiten: Nein
  •  
Diese Website benutzt Cookies
Wir benutzen Cookies um Sitzungsinformationen zu speichern. Dies erleichtert es uns z.B. Dich an Deine Login zu erinnern, Einstellungen der Webseite zu speichern, Inhalte und Werbung zu personalisieren, Social Media Funktionen anzubieten und unser Datenaufkommen zu analysieren. Wir teilen diese Informationen ebenfalls mit unseren Social Media-, Werbe- und Analysepartnern.
     
Alle Zeitangaben in WEZ +1. Es ist jetzt 08:02 Uhr.
Powered by vBulletin® Version 4.2.3 (Deutsch)
Copyright ©2017 Adduco Digital e.K. und vBulletin Solutions, Inc. Alle Rechte vorbehalten.
Resources saved on this page: MySQL 5,56%
Parts of this site powered by vBulletin Mods & Addons from DragonByte Technologies Ltd. (Details)
vBulletin Skin By: PurevB.com