Thanks Thanks:  107
Seite 15 von 37 ErsteErste ... 5131415161725 ... LetzteLetzte
Ergebnis 141 bis 150 von 366
  1. #141
    Anfänger
    Registriert seit
    06.04.2013
    Beiträge
    21
    Total Downloaded
    615,35 MB
    Total Downloaded
    615,35 MB
    ReceiverDankeAktivitäten
    Zitat Zitat von Thomas4711 Beitrag anzeigen
    SH4 eben, ich denke 99% der User im Board haben mipsel, restliche 1% teilt sich auf auf arm und Sh4.
    Wer sagt das ich sh4 baue.Build own openATV SH4 Image

    •   Alt Advertising

       

  2. #142
    Avatar von Thomas4711
    Registriert seit
    07.04.2013
    Ort
    OpenATV - Wien
    Beiträge
    13.166
    Total Downloaded
    51,16 MB
    Total Downloaded
    51,16 MB
    ReceiverDankeAktivitäten
    Der thread Titel?



  3. #143
    Anfänger
    Registriert seit
    06.04.2013
    Beiträge
    21
    Total Downloaded
    615,35 MB
    Total Downloaded
    615,35 MB
    ReceiverDankeAktivitäten
    Ja stimmt aber man kann auch für mipsel bauen z.b gigablue quad

  4. #144
    Senior Mitglied
    Registriert seit
    22.07.2014
    Beiträge
    144
    Total Downloaded
    468,25 MB
    Total Downloaded
    468,25 MB
    ReceiverDankeAktivitäten
    Box 1:
    GM Triplex
     
     
    Box 2:
    GM Triplex
     
     
    Box 3:
    einige GM 990 Reloaded und GM Triplex im Umkreis
     
     
    Und da das Einbinden identisch sein sollte, verstehe ich nicht, warum kein Mipsler eine Antwort parat hat. Och ich mag meine Triplex(e).

    MfG

  5. #145
    Anfänger
    Registriert seit
    22.10.2014
    Beiträge
    17
    Total Downloaded
    9,83 MB
    Total Downloaded
    9,83 MB
    ReceiverDankeAktivitäten
    Morgen

    ich habe mir die seiten durchgelesen und bekomme folgenden fehler einfach nicht gebacken.

    /tmp/sysroots/spark7162/usr/lib/libdbus-1.so /home/serverandy/openatv/build-enviroment/builds/openatv/spark7162/tmp/sysroots/spark7162/usr/lib/libavahi-common.so -lwrap /home/serverandy/openatv/build-enviroment/builds/openatv/spark7162/tmp/sysroots/spark7162/usr/lib/libacl.so /home/serverandy/openatv/build-enviroment/builds/openatv/spark7162/tmp/sysroots/spark7162/usr/lib/libattr.so -lpthread -ldl -pthread
    | /home/serverandy/openatv/build-enviroment/builds/openatv/spark7162/tmp/sysroots/x86_64-linux/usr/bin/sh4-oe-linux/../../libexec/sh4-oe-linux/gcc/sh4-oe-linux/4.8.2/ld: warning: library search path "/lib/x86_64-linux-gnu" is unsafe for cross-compilation
    | /lib/x86_64-linux-gnu/libgcc_s.so.1: file not recognized: File format not recognized
    | collect2: error: ld returned 1 exit status
    | make[3]: *** [afpd] Error 1
    | make[3]: Leaving directory `/home/serverandy/openatv/build-enviroment/builds/openatv/spark7162/tmp/work/sh4-oe-linux/netatalk/2.2.3-4/build/etc/afpd'
    | make[2]: *** [all-recursive] Error 1
    | make[2]: Leaving directory `/home/serverandy/openatv/build-enviroment/builds/openatv/spark7162/tmp/work/sh4-oe-linux/netatalk/2.2.3-4/build/etc'
    | make[1]: *** [all-recursive] Error 1
    | make[1]: Leaving directory `/home/serverandy/openatv/build-enviroment/builds/openatv/spark7162/tmp/work/sh4-oe-linux/netatalk/2.2.3-4/build'
    | make: *** [all] Error 2
    | ERROR: oe_runmake failed
    | WARNING: /home/serverandy/openatv/build-enviroment/builds/openatv/spark7162/tmp/work/sh4-oe-linux/netatalk/2.2.3-4/temp/run.do_compile.6970:1 exit 1 from
    | exit 1
    | ERROR: Function failed: do_compile (log file is located at /home/serverandy/openatv/build-enviroment/builds/openatv/spark7162/tmp/work/sh4-oe-linux/netatalk/2.2.3-4/temp/log.do_compile.6970)
    ERROR: Task 3732 (/home/serverandy/openatv/build-enviroment/meta-oe-alliance/meta-oe/recipes-connectivity/netatalk/netatalk_2.2.3.bb, do_compile) failed with exit code '1'
    NOTE: Tasks Summary: Attempted 9640 tasks of which 9619 didn't need to be rerun and 1 failed.
    Waiting for 0 running tasks to finish:


    Summary: 1 task failed:
    /home/serverandy/openatv/build-enviroment/meta-oe-alliance/meta-oe/recipes-connectivity/netatalk/netatalk_2.2.3.bb, do_compile
    Summary: There were 45 WARNING messages shown.
    Summary: There was 1 ERROR message shown, returning a non-zero exit code.
    make: *** [image] Error 1

    ich habe gelesen das sich dein system wohl verlaufen ?

    Kann das sein das da noch ein dev - Paket fehlt ? Hat jemand ein tip für mich ?

    serverandy

    ps
    mein system

    DISTRIB_ID=Ubuntu
    DISTRIB_RELEASE=12.04
    DISTRIB_CODENAME=precise
    DISTRIB_DESCRIPTION="Ubuntu 12.04.4 LTS"
    64 bit
    Geändert von serverandy (26.10.2014 um 10:13 Uhr)

  6. #146
    Anfänger
    Registriert seit
    22.10.2014
    Beiträge
    17
    Total Downloaded
    9,83 MB
    Total Downloaded
    9,83 MB
    ReceiverDankeAktivitäten
    hallo

    hat sich erledigt habe neuen server aufgesetzt mit ubuntu 14.04 hat dann durchgebaut.

    gruss serverandy
    Geändert von serverandy (29.10.2014 um 12:19 Uhr)

  7. #147
    Anfänger
    Registriert seit
    06.04.2013
    Beiträge
    21
    Total Downloaded
    615,35 MB
    Total Downloaded
    615,35 MB
    ReceiverDankeAktivitäten
    Hast du es auch hin bekommen eigene Änderungen mit einzubauen?

  8. #148
    Anfänger
    Registriert seit
    22.10.2014
    Beiträge
    17
    Total Downloaded
    9,83 MB
    Total Downloaded
    9,83 MB
    ReceiverDankeAktivitäten
    nein noch nicht richtig bin noch am versuchen.

    serverandy

  9. #149
    Anfänger
    Registriert seit
    06.04.2013
    Beiträge
    21
    Total Downloaded
    615,35 MB
    Total Downloaded
    615,35 MB
    ReceiverDankeAktivitäten
    Dann Berichte mal bei Erfolg oder Niederlage

  10. #150
    Anfänger
    Registriert seit
    22.10.2014
    Beiträge
    17
    Total Downloaded
    9,83 MB
    Total Downloaded
    9,83 MB
    ReceiverDankeAktivitäten
    neues problem nach make update

    ERROR: Error executing a python function in /home/andy/imagebauop/openatv/build-enviroment/meta-oe-alliance/meta-oe/recipes-oe-alliance/enigma2/enigma2.bb:


    The stack trace of python calls that resulted in this exception/failure was:
    File: 'do_package_ipk', lineno: 236, function: <module>
    0232: bb.utils.unlockfile(lf)
    0233:
    0234:
    0235:
    *** 0236:do_package_ipk(d)
    0237:
    File: 'do_package_ipk', lineno: 88, function: do_package_ipk
    0084:
    0085: controldir = os.path.join(root, 'CONTROL')
    0086: bb.utils.mkdirhier(controldir)
    0087: try:
    *** 0088: ctrlfile = open(os.path.join(controldir, 'control'), 'w')
    0089: except OSError:
    0090: bb.utils.unlockfile(lf)
    0091: raise bb.build.FuncFailed("unable to open control file for writing.")
    0092:
    Exception: IOError: [Errno 21] Is a directory: '/home/andy/imagebauop/openatv/build-enviroment/builds/openatv/spark7162/tmp/work/spark7162-oe-linux/enigma2/3.0+gitAUTOINC+dd802e5e7b-r14/packages-split/enigma2-locale-nl/CONTROL/control'


    ERROR: Function failed: do_package_ipk
    ERROR: Logfile of failure stored in: /home/andy/imagebauop/openatv/build-enviroment/builds/openatv/spark7162/tmp/work/spark7162-oe-linux/enigma2/3.0+gitAUTOINC+dd802e5e7b-r14/temp/log.do_package_write_ipk.13002
    ERROR: Task 1108 (/home/andy/imagebauop/openatv/build-enviroment/meta-oe-alliance/meta-oe/recipes-oe-alliance/enigma2/enigma2.bb, do_package_write_ipk) failed with exit code '1'

    NOTE: Tasks Summary: Attempted 6760 tasks of which 6751 didn't need to be rerun and 1 failed.
    Waiting for 0 running tasks to finish:


    Summary: 1 task failed:
    /home/andy/imagebauop/openatv/build-enviroment/meta-oe-alliance/meta-oe/recipes-oe-alliance/enigma2/enigma2.bb, do_package_write_ipk
    Summary: There were 45 WARNING messages shown.
    Summary: There were 2 ERROR messages shown, returning a non-zero exit code.
    make: *** [image] Fehler 1
    serverandy


Seite 15 von 37 ErsteErste ... 5131415161725 ... LetzteLetzte

Stichworte

Lesezeichen

Berechtigungen

  • Neue Themen erstellen: Nein
  • Themen beantworten: Nein
  • Anhänge hochladen: Nein
  • Beiträge bearbeiten: Nein
  •  
Diese Website benutzt Cookies
Wir benutzen Cookies um Sitzungsinformationen zu speichern. Dies erleichtert es uns z.B. Dich an Deine Login zu erinnern, Einstellungen der Webseite zu speichern, Inhalte und Werbung zu personalisieren, Social Media Funktionen anzubieten und unser Datenaufkommen zu analysieren. Wir teilen diese Informationen ebenfalls mit unseren Social Media-, Werbe- und Analysepartnern.
     
Alle Zeitangaben in WEZ +1. Es ist jetzt 10:54 Uhr.
Powered by vBulletin® Version 4.2.3 (Deutsch)
Copyright ©2017 Adduco Digital e.K. und vBulletin Solutions, Inc. Alle Rechte vorbehalten.
Resources saved on this page: MySQL 5,88%
Parts of this site powered by vBulletin Mods & Addons from DragonByte Technologies Ltd. (Details)
vBulletin Skin By: PurevB.com