Thanks Thanks:  110
Seite 12 von 38 ErsteErste ... 2101112131422 ... LetzteLetzte
Ergebnis 111 bis 120 von 372
  1. #111
    Avatar von Captain
    Registriert seit
    03.04.2013
    Beiträge
    10.202
    Themenstarter
    Total Downloaded
    162,35 MB
    Total Downloaded
    162,35 MB
    ReceiverDankeAktivitäten
    da muss deine Build Umgebung Verlaufen haben: libgcc_s.so.1: file not recognized: File format not recognized

    nach mal Probieren, normal kommt das nicht

    •   Alt Advertising

       

  2. #112
    Anfänger
    Registriert seit
    21.07.2014
    Beiträge
    23
    Total Downloaded
    0
    Total Downloaded
    0
    ReceiverDankeAktivitäten
    @Captain: Du hattest doch Recht mit dem Patch, er muss natürlich auf openssl-old 0.9.8x sinngemäß angewendet werden. Wenn man dann noch den nodocs-Patch von oben einbindet, lässt sich openssl-old auch unter Ubuntu 14.04. bauen. Danke+Gruß

  3. #113
    Mitglied
    Registriert seit
    26.01.2014
    Beiträge
    38
    Total Downloaded
    14,51 MB
    Total Downloaded
    14,51 MB
    ReceiverDankeAktivitäten
    Zitat Zitat von ava.gu Beitrag anzeigen
    @gjstroom: I applied your patch but openssl-old still does not build on ubuntu 14.04:
    Code:
    ERROR: Function failed: do_configure (log file is located at /home/ubuntu/openatv/build-enviroment/builds/openatv/spark/tmp/work/sh4-oe-linux/openssl-old/0.9.8x-r15.0/temp/log.do_configure.17909)ERROR: Logfile of failure stored in: /home/ubuntu/openatv/build-enviroment/builds/openatv/spark/tmp/work/sh4-oe-linux/openssl-old/0.9.8x-r15.0/temp/log.do_configure.17909
    Log data follows:
    | DEBUG: Executing python function sysroot_cleansstate
    | DEBUG: Python function sysroot_cleansstate finished
    | DEBUG: Executing shell function do_configure
    | Can't locate find.pl in @INC (@INC contains: /etc/perl /usr/local/lib/perl/5.18.2 /usr/local/share/perl/5.18.2 /usr/lib/perl5 /usr/share/perl5 /usr/lib/perl/5.18 /usr/share/perl/5.18 /usr/local/lib/site_perl .) at perlpath.pl line 7.
    | WARNING: /home/ubuntu/openatv/build-enviroment/builds/openatv/spark/tmp/work/sh4-oe-linux/openssl-old/0.9.8x-r15.0/temp/run.do_configure.17909:1 exit 2 from
    |   perl perlpath.pl /home/ubuntu/openatv/build-enviroment/builds/openatv/spark/tmp/sysroots/i686-linux/usr/bin
    | ERROR: Function failed: do_configure (log file is located at /home/ubuntu/openatv/build-enviroment/builds/openatv/spark/tmp/work/sh4-oe-linux/openssl-old/0.9.8x-r15.0/temp/log.do_configure.17909)
    ERROR: Task 3830 (/home/ubuntu/openatv/build-enviroment/meta-oe-alliance/meta-oe/recipes-connectivity/openssl/openssl-old_0.9.8x.bb, do_configure) failed with exit code '1'
    Or did I misunderstand your patch?
    You also need to install on Ubuntu 14.04:
    sudo apt-get install libproc-processtable-perl
    sudo apt-get install libperl4-corelibs-perl


    Put patch file in meta-oe-alliance/meta-oe/recipes-connectivity/openssl/openssl-old/debian/openssl-0.9.8x-nodocs.patch and add 'file://debian/openssl-0.9.8x-nodocs.patch' to meta-oe-alliance/meta-oe/recipes-connectivity/openssl/openssl-old_0.9.8x.bb

    openssl-0.9.8x-nodocs.patch
    Code:
    --- openssl-0.9.8x.orig/Makefile.org    2010-01-27 17:06:36.000000000 +0100
    +++ openssl-0.9.8x/Makefile.org 2014-08-24 13:35:14.335683341 +0200
    @@ -615,7 +615,7 @@
     dist_pem_h:
            (cd crypto/pem; $(MAKE) -e $(BUILDENV) pem.h; $(MAKE) clean)
    
    -install: all install_docs install_sw
    +install: all install_sw
    
     install_sw:
            @$(PERL) $(TOP)/util/mkdir-p.pl $(INSTALL_PREFIX)$(INSTALLTOP)/bin \
    Geändert von gjstroom (28.08.2014 um 22:22 Uhr)

  4. #114
    Anfänger
    Registriert seit
    21.07.2014
    Beiträge
    23
    Total Downloaded
    0
    Total Downloaded
    0
    ReceiverDankeAktivitäten
    @gjstroom: Thanks for your reply, I already managed to apply you patch - it works fine now. Thanks!

  5. #115
    Anfänger
    Registriert seit
    21.07.2014
    Beiträge
    23
    Total Downloaded
    0
    Total Downloaded
    0
    ReceiverDankeAktivitäten
    Nur ein kurzer Hinweis an die devs: Der Patch 'proc_progress.patch' führt immer zu einer Unterbrechnung der build-Prozesses; hier das log dazu:
    Code:
    1: sysvinit-2.88dsf-r14 do_patch (pid 3326)Trying to run: screen -r devshell_3326
    *** Manual patch resolution mode ***
    Dropping to a shell, so patch rejects can be fixed manually.
    Run "quilt refresh" when patch is corrected, press CTRL+D to exit.
    
    
    Applying patch proc_progress.patch
    Ignoring potentially dangerous file name ../rc
    can't find file to patch at input line 3
    Perhaps you used the wrong -p or --strip option?
    The text leading up to this was:
    --------------------------
    |--- a/../rc    2013-05-07 15:04:31.964626327 +0100
    |+++ b/../rc    2013-05-07 15:04:20.388625248 +0100
    --------------------------
    File to patch:
    Skip this patch? [y]
    Skipping patch.
    1 out of 1 hunk ignored
    Patch proc_progress.patch appears to be empty; applied
    Vielleicht hat ja jemand Zeit (und Lust) sich das mal anzusehen. Grüße

  6. #116
    Anfänger
    Registriert seit
    21.07.2014
    Beiträge
    23
    Total Downloaded
    0
    Total Downloaded
    0
    ReceiverDankeAktivitäten
    @captain: Vielen Dank für den neuen Ordner meta-local und local-recipes, doch leider werden die dort abgelegten recipes nicht berücksichtigt.... Leider beschäftigte ich mich erst jetzt mit bitbake und frage mich, ob man den neuen Ort meta-local noch irgendwie einbinden muss...
    Code:
    Parsing of 2511 .bb files complete (2194 cached, 317 parsed). 2997 targets, 108 skipped, 0 masked, 0 errors.
    WARNING: No bb files matched BBFILE_PATTERN_local-layer '^/home/ubuntu/openatv/build-enviroment/meta-local/'
    Ich verstehe die Warnung nicht, denn ich habe .bb files sowohl in meta-local als auch in meta-local/local-recipes erstellt, die jedoch nicht beachtet werden

  7. #117
    Avatar von Captain
    Registriert seit
    03.04.2013
    Beiträge
    10.202
    Themenstarter
    Total Downloaded
    162,35 MB
    Total Downloaded
    162,35 MB
    ReceiverDankeAktivitäten
    anlegen nur im Ordner : recipes-local da z.b. einen Unterordner anlegen: enigma2 und im enigma2 Ordner z.b. eine enigma2.bbappend anlegen für seine Private e2 Anpassungen

    so geht das also die Ordner Struktur mit den ebenen muss eingehalten werden bb files in der meta-local direkt werden nicht gefunden: erst im enigma2 Ordner in diesen Beispiel

  8. Thanks ava.gu, Lizard, /dev/null bedankten sich
  9. #118
    Anfänger
    Registriert seit
    21.07.2014
    Beiträge
    23
    Total Downloaded
    0
    Total Downloaded
    0
    ReceiverDankeAktivitäten
    Jetzt geht's. Besten Dank

  10. #119
    Avatar von Captain
    Registriert seit
    03.04.2013
    Beiträge
    10.202
    Themenstarter
    Total Downloaded
    162,35 MB
    Total Downloaded
    162,35 MB
    ReceiverDankeAktivitäten
    Wichtige Änderung, Important Change !!!!

    Git SH4 wurde nun in das Master git der OE-A Umgezogen

    Bitte Build Ordner Löschen und neu bauen !

    Git SH4 was merge to Master OE-A Git

    Please Build all new

    neue URL für SH4: git clone git://github.com/oe-alliance/build-enviroment.git

    new URL for SH4: git clone git://github.com/oe-alliance/build-enviroment.git

  11. #120
    Avatar von Lizard
    Registriert seit
    09.04.2013
    Beiträge
    144
    Total Downloaded
    4,17 MB
    Total Downloaded
    4,17 MB
    ReceiverDankeAktivitäten
    Box 1:
    Edision OS mega
     
     
    Box 2:
    Edision OS Mini / OS Mini +
     
     
    Box 3:
    Edision Optimuss OS1+/OS2+/OS3+
     
     
    Box 4:
    Edision Optimuss OS1/OS2
     
     
    Box 5:
    Edision Pingulux
     
     
    ... hab hier im Moment noch ein kleines Problemchen beim bauen

    Code:
    ERROR: Function failed: do_compile (log file is located at /home/lizard/git-builds/spark/build-enviroment/builds/openatv/spark/tmp/work/spark-oe-linux/stlirc/0.9.0-r2/temp/log.do_compile.3919)
    ERROR: Logfile of failure stored in: /home/lizard/git-builds/spark/build-enviroment/builds/openatv/spark/tmp/work/spark-oe-linux/stlirc/0.9.0-r2/temp/log.do_compile.3919
    Log data follows:
    | DEBUG: SITE files ['endian-little', 'bit-32', 'sh-common', 'common-linux', 'common-glibc', 'sh4-linux', 'common']
    | DEBUG: Executing shell function do_compile
    | NOTE: make SUBDIRS=daemons tools
    | make  all-recursive
    | make[1]: Entering directory `/home/lizard/git-builds/spark/build-enviroment/builds/openatv/spark/tmp/work/spark-oe-linux/stlirc/0.9.0-r2/build'
    | Making all in daemons
    | make[2]: Entering directory `/home/lizard/git-builds/spark/build-enviroment/builds/openatv/spark/tmp/work/spark-oe-linux/stlirc/0.9.0-r2/build/daemons'
    | make  all-am
    | make[3]: Entering directory `/home/lizard/git-builds/spark/build-enviroment/builds/openatv/spark/tmp/work/spark-oe-linux/stlirc/0.9.0-r2/build/daemons'
    | ../sh4-oe-linux-libtool  --tag=CC   --mode=link sh4-oe-linux-gcc  -ml -m4 --sysroot=/home/lizard/git-builds/spark/build-enviroment/builds/openatv/spark/tmp/sysroots/spark  -Os -pipe -g -feliminate-unused-debug-types -DUINPUT_NEUTRINO_HACK        -Wl,-O1 -Wl,--hash-style=gnu -Wl,--as-needed -o irrecord irrecord.o config_file.o dump_config.o input_map.o transmit.o libhw_module.a -lasound -L/usr/lib/x86_64-linux-gnu -lusb -L/usr/lib/x86_64-linux-gnu -lusb  -L/usr/lib/x86_64-linux-gnu -lusb -L/usr/lib/x86_64-linux-gnu -lusb     -L/usr/lib/x86_64-linux-gnu -lusb -lpthread
    | sh4-oe-linux-libtool: link: sh4-oe-linux-gcc -ml -m4 --sysroot=/home/lizard/git-builds/spark/build-enviroment/builds/openatv/spark/tmp/sysroots/spark -Os -pipe -g -feliminate-unused-debug-types -DUINPUT_NEUTRINO_HACK -Wl,-O1 -Wl,--hash-style=gnu -Wl,--as-needed -o irrecord irrecord.o config_file.o dump_config.o input_map.o transmit.o  libhw_module.a /home/lizard/git-builds/spark/build-enviroment/builds/openatv/spark/tmp/sysroots/spark/usr/lib/libasound.so -lm -ldl -lrt -L/usr/lib/x86_64-linux-gnu -lusb -lpthread
    | /home/lizard/git-builds/spark/build-enviroment/builds/openatv/spark/tmp/sysroots/x86_64-linux/usr/libexec/sh4-oe-linux/gcc/sh4-oe-linux/4.8.2/ld: warning: library search path "/usr/lib/x86_64-linux-gnu" is unsafe for cross-compilation
    | /usr/lib/x86_64-linux-gnu/libm.so: file not recognized: File format not recognized
    | collect2: error: ld returned 1 exit status
    | make[3]: *** [irrecord] Error 1
    | make[3]: Leaving directory `/home/lizard/git-builds/spark/build-enviroment/builds/openatv/spark/tmp/work/spark-oe-linux/stlirc/0.9.0-r2/build/daemons'
    | make[2]: *** [all] Error 2
    | make[2]: Leaving directory `/home/lizard/git-builds/spark/build-enviroment/builds/openatv/spark/tmp/work/spark-oe-linux/stlirc/0.9.0-r2/build/daemons'
    | make[1]: *** [all-recursive] Error 1
    | make[1]: Leaving directory `/home/lizard/git-builds/spark/build-enviroment/builds/openatv/spark/tmp/work/spark-oe-linux/stlirc/0.9.0-r2/build'
    | make: *** [all] Error 2
    | ERROR: oe_runmake failed
    | WARNING: /home/lizard/git-builds/spark/build-enviroment/builds/openatv/spark/tmp/work/spark-oe-linux/stlirc/0.9.0-r2/temp/run.do_compile.3919:1 exit 1 from
    |   exit 1
    | ERROR: Function failed: do_compile (log file is located at /home/lizard/git-builds/spark/build-enviroment/builds/openatv/spark/tmp/work/spark-oe-linux/stlirc/0.9.0-r2/temp/log.do_compile.3919)
    ERROR: Task 5118 (/home/lizard/git-builds/spark/build-enviroment/meta-oe-alliance/meta-brands/meta-fulan/recipes-bsp/stlirc_0.9.0.bb, do_compile) failed with exit code '1'
    NOTE: Tasks Summary: Attempted 7344 tasks of which 7312 didn't need to be rerun and 1 failed.
    Waiting for 0 running tasks to finish:
    
    Summary: 1 task failed:
      /home/lizard/git-builds/spark/build-enviroment/meta-oe-alliance/meta-brands/meta-fulan/recipes-bsp/stlirc_0.9.0.bb, do_compile
    Summary: There were 47 WARNING messages shown.
    Summary: There was 1 ERROR message shown, returning a non-zero exit code.
    make: *** [image] Fehler 1
    verwendet wird Ubuntu 12.04 64-Bit
    Code:
    MACHINE=arguspingulux DISTRO=openatv make image
    Git wurde 2x neu ge'clone't, auch beim 2ten Buildversuch bleibt's an der gleichen Stelle hängen.
    Geändert von Lizard (05.09.2014 um 01:46 Uhr)


Seite 12 von 38 ErsteErste ... 2101112131422 ... LetzteLetzte

Stichworte

Lesezeichen

Berechtigungen

  • Neue Themen erstellen: Nein
  • Themen beantworten: Nein
  • Anhänge hochladen: Nein
  • Beiträge bearbeiten: Nein
  •  
Diese Website benutzt Cookies
Wir benutzen Cookies um Sitzungsinformationen zu speichern. Dies erleichtert es uns z.B. Dich an Deine Login zu erinnern, Einstellungen der Webseite zu speichern, Inhalte und Werbung zu personalisieren, Social Media Funktionen anzubieten und unser Datenaufkommen zu analysieren. Wir teilen diese Informationen ebenfalls mit unseren Social Media-, Werbe- und Analysepartnern.
     
Alle Zeitangaben in WEZ +1. Es ist jetzt 13:47 Uhr.
Powered by vBulletin® Version 4.2.3 (Deutsch)
Copyright ©2017 Adduco Digital e.K. und vBulletin Solutions, Inc. Alle Rechte vorbehalten.
Resources saved on this page: MySQL 5,56%
Parts of this site powered by vBulletin Mods & Addons from DragonByte Technologies Ltd. (Details)
vBulletin Skin By: PurevB.com