Thanks Thanks:  107
Seite 11 von 37 ErsteErste ... 91011121321 ... LetzteLetzte
Ergebnis 101 bis 110 von 366
  1. #101
    Mitglied
    Registriert seit
    26.01.2014
    Beiträge
    38
    Total Downloaded
    13,54 MB
    Total Downloaded
    13,54 MB
    ReceiverDankeAktivitäten
    Indeed 12.04 has no problems, I'll search some more for a solution on 12.4

    I found this: https://github.com/vigsterkr/buildro...-nodocs.patch: "Dont waste time building manpages if we're not going to use em"

    I remade this patch for openssl-0.9.8x, and it's working.

    openssl-0.9.8x-nodocs.patch
    Code:
    --- openssl-0.9.8x.orig/Makefile.org    2010-01-27 17:06:36.000000000 +0100
    +++ openssl-0.9.8x/Makefile.org 2014-08-24 13:35:14.335683341 +0200
    @@ -615,7 +615,7 @@
     dist_pem_h:
            (cd crypto/pem; $(MAKE) -e $(BUILDENV) pem.h; $(MAKE) clean)
    
    -install: all install_docs install_sw
    +install: all install_sw
    
     install_sw:
            @$(PERL) $(TOP)/util/mkdir-p.pl $(INSTALL_PREFIX)$(INSTALLTOP)/bin \
    Geändert von gjstroom (24.08.2014 um 12:47 Uhr)

    •   Alt Advertising

       

  2. #102
    Anfänger
    Registriert seit
    21.07.2014
    Beiträge
    23
    Total Downloaded
    0
    Total Downloaded
    0
    ReceiverDankeAktivitäten
    @gjstroom: I applied your patch but openssl-old still does not build on ubuntu 14.04:
    Code:
    ERROR: Function failed: do_configure (log file is located at /home/ubuntu/openatv/build-enviroment/builds/openatv/spark/tmp/work/sh4-oe-linux/openssl-old/0.9.8x-r15.0/temp/log.do_configure.17909)ERROR: Logfile of failure stored in: /home/ubuntu/openatv/build-enviroment/builds/openatv/spark/tmp/work/sh4-oe-linux/openssl-old/0.9.8x-r15.0/temp/log.do_configure.17909
    Log data follows:
    | DEBUG: Executing python function sysroot_cleansstate
    | DEBUG: Python function sysroot_cleansstate finished
    | DEBUG: Executing shell function do_configure
    | Can't locate find.pl in @INC (@INC contains: /etc/perl /usr/local/lib/perl/5.18.2 /usr/local/share/perl/5.18.2 /usr/lib/perl5 /usr/share/perl5 /usr/lib/perl/5.18 /usr/share/perl/5.18 /usr/local/lib/site_perl .) at perlpath.pl line 7.
    | WARNING: /home/ubuntu/openatv/build-enviroment/builds/openatv/spark/tmp/work/sh4-oe-linux/openssl-old/0.9.8x-r15.0/temp/run.do_configure.17909:1 exit 2 from
    |   perl perlpath.pl /home/ubuntu/openatv/build-enviroment/builds/openatv/spark/tmp/sysroots/i686-linux/usr/bin
    | ERROR: Function failed: do_configure (log file is located at /home/ubuntu/openatv/build-enviroment/builds/openatv/spark/tmp/work/sh4-oe-linux/openssl-old/0.9.8x-r15.0/temp/log.do_configure.17909)
    ERROR: Task 3830 (/home/ubuntu/openatv/build-enviroment/meta-oe-alliance/meta-oe/recipes-connectivity/openssl/openssl-old_0.9.8x.bb, do_configure) failed with exit code '1'
    Or did I misunderstand your patch?

  3. #103
    Avatar von Captain
    Registriert seit
    03.04.2013
    Beiträge
    9.704
    Themenstarter
    Total Downloaded
    162,35 MB
    Total Downloaded
    162,35 MB
    ReceiverDankeAktivitäten

  4. #104
    Anfänger
    Registriert seit
    21.07.2014
    Beiträge
    23
    Total Downloaded
    0
    Total Downloaded
    0
    ReceiverDankeAktivitäten
    Hallo Captain, Danke für den Link zu dem Patch, der m.E. jedoch angepasst werden muss; ich schaue mir das mal an.

    Eine andere kurze Frage: Bei meinem selbstgebauten Image funktioniert OSCam ( ich vermute dvbapi) nicht richtig, das Bild bleibt schwarz - das gleiche binary mit den gleichen Einstellungen funktioniert auf Euren Images tadellos. OSCam an sich läuft auch und ist per WebIF erreichbar. Muss ich irgendetwas noch beim Bauen zusätzlich konfigurieren oder wo sonst kann der Unterschied zu Euren Images liegen?

    Danke undGruß

  5. #105
    Avatar von Lizard
    Registriert seit
    09.04.2013
    Beiträge
    133
    Total Downloaded
    4,17 MB
    Total Downloaded
    4,17 MB
    ReceiverDankeAktivitäten
    Box 1:
    Edision OS mega
     
     
    Box 2:
    Edision OS Mini / OS Mini +
     
     
    Box 3:
    Edision Optimuss OS1+/OS2+/OS3+
     
     
    Box 4:
    Edision Optimuss OS1/OS2
     
     
    Box 5:
    Edision Pingulux
     
     
    Hm, Oscam, böses Wort hier (pti.ko).

  6. Thanks ava.gu bedankten sich
  7. #106
    Avatar von Captain
    Registriert seit
    03.04.2013
    Beiträge
    9.704
    Themenstarter
    Total Downloaded
    162,35 MB
    Total Downloaded
    162,35 MB
    ReceiverDankeAktivitäten
    du must die pti.ko aus den atv Image nehmen

  8. Thanks ava.gu bedankten sich
  9. #107
    Anfänger
    Registriert seit
    21.07.2014
    Beiträge
    23
    Total Downloaded
    0
    Total Downloaded
    0
    ReceiverDankeAktivitäten
    Perfekt, vielen Dank für die ganze Hilfsbereitschaft

  10. #108
    Anfänger
    Registriert seit
    21.07.2014
    Beiträge
    23
    Total Downloaded
    0
    Total Downloaded
    0
    ReceiverDankeAktivitäten
    Hallo Captain,

    ich habe mir den Patch mal angesehen und er ist grundsätzlich in den aktuellen Sourcen berücksichtigt. Wir haben das Problem, das find.pl in den aktuellen perl-Versionen, die Ubuntu 14.04. installiert, deprecated und nicht mehr verfügbar ist - aber der Patch löst das Problem irgendwie nicht. Selbst wenn man find.pl in dem perl-Pfad manuell verfügbar macht, läuft der Build von openssl-0.9.8x. unter ubuntu 14.04 nicht durch, aber ich weiß noch nicht warum. Der Umweg über libcrypto-compat-0.9.8. funktioniert aber derzeit.

    Grüße

  11. #109
    Anfänger
    Registriert seit
    24.04.2014
    Beiträge
    12
    Total Downloaded
    0
    Total Downloaded
    0
    ReceiverDankeAktivitäten
    wo sie zu setzen openssl-0.9.8x-nodocs.patch ??

    ok ich weiß

    /openatv/build-enviroment/sources
    Geändert von comag (28.08.2014 um 11:23 Uhr)

  12. #110
    Anfänger
    Registriert seit
    24.04.2014
    Beiträge
    12
    Total Downloaded
    0
    Total Downloaded
    0
    ReceiverDankeAktivitäten
    Leider habe ich diesen Fehler

    Code:
    | make[3]: Entering directory `/home/tas/openatv/build-enviroment/builds/openatv/spark/tmp/work/sh4-oe-linux/netatalk/2.2.3-4/build/etc/afpd'
    | ../../sh4-oe-linux-libtool  --tag=CC   --mode=link sh4-oe-linux-gcc  -ml -m4 --sysroot=/home/tas/openatv/build-enviroment/builds/openatv/spark/tmp/sysroots/spark -std=gnu99 -I/home/tas/openatv/build-enviroment/builds/openatv/spark/tmp/work/sh4-oe-linux/netatalk/2.2.3-4/netatalk-2.2.3/include -I/home/tas/openatv/build-enviroment/builds/openatv/spark/tmp/work/sh4-oe-linux/netatalk/2.2.3-4/netatalk-2.2.3/sys -D_REENTRANT -DAPPLCNAME -DSERVERTEXT=\"/etc/netatalk/msg/\" -D_PATH_AFPDDEFVOL=\"/etc/netatalk/AppleVolumes.default\" -D_PATH_AFPDSYSVOL=\"/etc/netatalk/AppleVolumes.system\" -D_PATH_AFPDPWFILE=\"/etc/netatalk/afppasswd\" -D_PATH_AFPDCONF=\"/etc/netatalk/afpd.conf\" -D_PATH_AFPDSIGCONF=\"/etc/netatalk/afp_signature.conf\" -D_PATH_AFPDUAMPATH=\"/etc/netatalk/uams/\" -D_PATH_ACL_LDAPCONF=\"/etc/netatalk/afp_ldap.conf\" -D_PATH_AFPDUUIDCONF=\"/etc/netatalk/afp_voluuid.conf\" -I/home/tas/openatv/build-enviroment/builds/openatv/spark/tmp/work/sh4-oe-linux/netatalk/2.2.3-4/netatalk-2.2.3/include -D_U_="__attribute__((unused))"  -Os -pipe -g -feliminate-unused-debug-types -I/home/tas/openatv/build-enviroment/builds/openatv/spark/tmp/work/sh4-oe-linux/netatalk/2.2.3-4/netatalk-2.2.3/sys -export-dynamic  -Wl,-O1 -Wl,--hash-style=gnu -Wl,--as-needed -lpthread -L/home/tas/openatv/build-enviroment/builds/openatv/spark/tmp/sysroots/spark/usr/lib -o afpd afpd-afp_asp.o afpd-afp_avahi.o afpd-afp_config.o afpd-afp_dsi.o afpd-afp_mdns.o afpd-afp_options.o afpd-afp_util.o afpd-afp_zeroconf.o afpd-afprun.o afpd-afs.o afpd-appl.o afpd-auth.o afpd-catsearch.o afpd-desktop.o afpd-dircache.o afpd-directory.o afpd-enumerate.o afpd-extattrs.o afpd-fce_api.o afpd-fce_util.o afpd-file.o afpd-filedir.o afpd-fork.o afpd-gettok.o afpd-hash.o afpd-main.o afpd-mangle.o afpd-messages.o afpd-nfsquota.o afpd-ofork.o afpd-quota.o afpd-status.o afpd-switch.o afpd-uam.o afpd-uid.o afpd-unix.o afpd-volume.o afpd-acls.o ../../libatalk/cnid/libcnid.la ../../libatalk/libatalk.la -L/lib/x86_64-linux-gnu -lgcrypt  -lavahi-common -lavahi-client   -lwrap -ldl   -lacl -lattr -lpthread -lpthread -ldl  -L/home/tas/openatv/build-enviroment/builds/openatv/spark/tmp/work/sh4-oe-linux/netatalk/2.2.3-4/netatalk-2.2.3/libatalk
    | sh4-oe-linux-libtool: link: sh4-oe-linux-gcc -ml -m4 --sysroot=/home/tas/openatv/build-enviroment/builds/openatv/spark/tmp/sysroots/spark -std=gnu99 -I/home/tas/openatv/build-enviroment/builds/openatv/spark/tmp/work/sh4-oe-linux/netatalk/2.2.3-4/netatalk-2.2.3/include -I/home/tas/openatv/build-enviroment/builds/openatv/spark/tmp/work/sh4-oe-linux/netatalk/2.2.3-4/netatalk-2.2.3/sys -D_REENTRANT -DAPPLCNAME -DSERVERTEXT=\"/etc/netatalk/msg/\" -D_PATH_AFPDDEFVOL=\"/etc/netatalk/AppleVolumes.default\" -D_PATH_AFPDSYSVOL=\"/etc/netatalk/AppleVolumes.system\" -D_PATH_AFPDPWFILE=\"/etc/netatalk/afppasswd\" -D_PATH_AFPDCONF=\"/etc/netatalk/afpd.conf\" -D_PATH_AFPDSIGCONF=\"/etc/netatalk/afp_signature.conf\" -D_PATH_AFPDUAMPATH=\"/etc/netatalk/uams/\" -D_PATH_ACL_LDAPCONF=\"/etc/netatalk/afp_ldap.conf\" -D_PATH_AFPDUUIDCONF=\"/etc/netatalk/afp_voluuid.conf\" -I/home/tas/openatv/build-enviroment/builds/openatv/spark/tmp/work/sh4-oe-linux/netatalk/2.2.3-4/netatalk-2.2.3/include "-D_U_=__attribute__((unused))" -Os -pipe -g -feliminate-unused-debug-types -I/home/tas/openatv/build-enviroment/builds/openatv/spark/tmp/work/sh4-oe-linux/netatalk/2.2.3-4/netatalk-2.2.3/sys -Wl,-O1 -Wl,--hash-style=gnu -Wl,--as-needed -o afpd afpd-afp_asp.o afpd-afp_avahi.o afpd-afp_config.o afpd-afp_dsi.o afpd-afp_mdns.o afpd-afp_options.o afpd-afp_util.o afpd-afp_zeroconf.o afpd-afprun.o afpd-afs.o afpd-appl.o afpd-auth.o afpd-catsearch.o afpd-desktop.o afpd-dircache.o afpd-directory.o afpd-enumerate.o afpd-extattrs.o afpd-fce_api.o afpd-fce_util.o afpd-file.o afpd-filedir.o afpd-fork.o afpd-gettok.o afpd-hash.o afpd-main.o afpd-mangle.o afpd-messages.o afpd-nfsquota.o afpd-ofork.o afpd-quota.o afpd-status.o afpd-switch.o afpd-uam.o afpd-uid.o afpd-unix.o afpd-volume.o afpd-acls.o -Wl,--export-dynamic  -L/home/tas/openatv/build-enviroment/builds/openatv/spark/tmp/sysroots/spark/usr/lib ../../libatalk/cnid/.libs/libcnid.a -L/home/tas/openatv/build-enviroment/builds/openatv/spark/tmp/work/sh4-oe-linux/netatalk/2.2.3-4/netatalk-2.2.3/libatalk ../../libatalk/.libs/libatalk.a -L/lib/x86_64-linux-gnu /home/tas/openatv/build-enviroment/builds/openatv/spark/tmp/sysroots/spark/usr/lib/libgcrypt.so /home/tas/openatv/build-enviroment/builds/openatv/spark/tmp/sysroots/spark/usr/lib/libgpg-error.so -lcap /home/tas/openatv/build-enviroment/builds/openatv/spark/tmp/sysroots/spark/usr/lib/libavahi-client.so /home/tas/openatv/build-enviroment/builds/openatv/spark/tmp/sysroots/spark/usr/lib/libdbus-1.so /home/tas/openatv/build-enviroment/builds/openatv/spark/tmp/sysroots/spark/usr/lib/libavahi-common.so -lwrap /home/tas/openatv/build-enviroment/builds/openatv/spark/tmp/sysroots/spark/usr/lib/libacl.so /home/tas/openatv/build-enviroment/builds/openatv/spark/tmp/sysroots/spark/usr/lib/libattr.so -lpthread -ldl -pthread
    | /home/tas/openatv/build-enviroment/builds/openatv/spark/tmp/sysroots/x86_64-linux/usr/libexec/sh4-oe-linux/gcc/sh4-oe-linux/4.8.2/ld: warning: library search path "/lib/x86_64-linux-gnu" is unsafe for cross-compilation
    | /lib/x86_64-linux-gnu/libgcc_s.so.1: file not recognized: File format not recognized
    | collect2: error: ld returned 1 exit status
    | make[3]: *** [afpd] Error 1
    | make[3]: Leaving directory `/home/tas/openatv/build-enviroment/builds/openatv/spark/tmp/work/sh4-oe-linux/netatalk/2.2.3-4/build/etc/afpd'
    | make[2]: *** [all-recursive] Error 1
    | make[2]: Leaving directory `/home/tas/openatv/build-enviroment/builds/openatv/spark/tmp/work/sh4-oe-linux/netatalk/2.2.3-4/build/etc'
    | make[1]: *** [all-recursive] Error 1
    | make[1]: Leaving directory `/home/tas/openatv/build-enviroment/builds/openatv/spark/tmp/work/sh4-oe-linux/netatalk/2.2.3-4/build'
    | make: *** [all] Error 2
    | ERROR: oe_runmake failed
    | WARNING: /home/tas/openatv/build-enviroment/builds/openatv/spark/tmp/work/sh4-oe-linux/netatalk/2.2.3-4/temp/run.do_compile.12535:1 exit 1 from
    |   exit 1
    | ERROR: Function failed: do_compile (log file is located at /home/tas/openatv/build-enviroment/builds/openatv/spark/tmp/work/sh4-oe-linux/netatalk/2.2.3-4/temp/log.do_compile.12535)
    ERROR: Task 3662 (/home/tas/openatv/build-enviroment/meta-oe-alliance/meta-oe/recipes-connectivity/netatalk/netatalk_2.2.3.bb, do_compile) failed with exit code '1'
    NOTE: Tasks Summary: Attempted 9414 tasks of which 9405 didn't need to be rerun and 1 failed.
    Waiting for 0 running tasks to finish:
    
    Summary: 1 task failed:
      /home/tas/openatv/build-enviroment/meta-oe-alliance/meta-oe/recipes-connectivity/netatalk/netatalk_2.2.3.bb, do_compile
    Summary: There were 46 WARNING messages shown.
    Summary: There was 1 ERROR message shown, returning a non-zero exit code.
    make: *** [image] Błąd 1
    tas@LINUX:~/openatv/build-enviroment$
    Geändert von comag (28.08.2014 um 11:49 Uhr)


Seite 11 von 37 ErsteErste ... 91011121321 ... LetzteLetzte

Stichworte

Lesezeichen

Berechtigungen

  • Neue Themen erstellen: Nein
  • Themen beantworten: Nein
  • Anhänge hochladen: Nein
  • Beiträge bearbeiten: Nein
  •  
Diese Website benutzt Cookies
Wir benutzen Cookies um Sitzungsinformationen zu speichern. Dies erleichtert es uns z.B. Dich an Deine Login zu erinnern, Einstellungen der Webseite zu speichern, Inhalte und Werbung zu personalisieren, Social Media Funktionen anzubieten und unser Datenaufkommen zu analysieren. Wir teilen diese Informationen ebenfalls mit unseren Social Media-, Werbe- und Analysepartnern.
     
Alle Zeitangaben in WEZ +1. Es ist jetzt 17:17 Uhr.
Powered by vBulletin® Version 4.2.3 (Deutsch)
Copyright ©2017 Adduco Digital e.K. und vBulletin Solutions, Inc. Alle Rechte vorbehalten.
Resources saved on this page: MySQL 5,56%
Parts of this site powered by vBulletin Mods & Addons from DragonByte Technologies Ltd. (Details)
vBulletin Skin By: PurevB.com