Thanks Thanks:  110
Seite 10 von 38 ErsteErste ... 8910111220 ... LetzteLetzte
Ergebnis 91 bis 100 von 372
  1. #91
    Anfänger
    Registriert seit
    21.07.2014
    Beiträge
    23
    Total Downloaded
    0
    Total Downloaded
    0
    ReceiverDankeAktivitäten
    Nachdem die letzten Tage der build sauber durchgelaufen ist, bekomme ich seit gestern folgende Fehlermeldung:
    Code:
    ERROR: Function failed: do_compile (log file is located at /home/ubuntu/openatv/build-enviroment/builds/openatv/spark/tmp/work/sh4-oe-linux/aio-grab/1.0+gitAUTOINC+6868d24b4f-r2/temp/log.do_compile.27998)ERROR: Logfile of failure stored in: /home/ubuntu/openatv/build-enviroment/builds/openatv/spark/tmp/work/sh4-oe-linux/aio-grab/1.0+gitAUTOINC+6868d24b4f-r2/temp/log.do_compile.27998
    Log data follows:
    | DEBUG: SITE files ['endian-little', 'bit-32', 'sh-common', 'common-linux', 'common-glibc', 'sh4-linux', 'common']
    | DEBUG: Executing shell function do_compile
    | NOTE: make -j 2
    | sh4-oe-linux-gcc  -ml -m4 --sysroot=/home/ubuntu/openatv/build-enviroment/builds/openatv/spark/tmp/sysroots/spark -DPACKAGE_NAME=\"\" -DPACKAGE_TARNAME=\"\" -DPACKAGE_VERSION=\"\" -DPACKAGE_STRING=\"\" -DPACKAGE_BUGREPORT=\"\" -DPACKAGE_URL=\"\" -DPACKAGE=\"grab\" -DVERSION=\"1.0\" -I. -I/home/ubuntu/openatv/build-enviroment/builds/openatv/spark/tmp/work/sh4-oe-linux/aio-grab/1.0+gitAUTOINC+6868d24b4f-r2/git     -Os -pipe -g -feliminate-unused-debug-types -c -o grab-main.o `test -f 'main.c' || echo '/home/ubuntu/openatv/build-enviroment/builds/openatv/spark/tmp/work/sh4-oe-linux/aio-grab/1.0+gitAUTOINC+6868d24b4f-r2/git/'`main.c
    | /home/ubuntu/openatv/build-enviroment/builds/openatv/spark/tmp/work/sh4-oe-linux/aio-grab/1.0+gitAUTOINC+6868d24b4f-r2/git/main.c: In function 'main':
    | /home/ubuntu/openatv/build-enviroment/builds/openatv/spark/tmp/work/sh4-oe-linux/aio-grab/1.0+gitAUTOINC+6868d24b4f-r2/git/main.c:191:64: error: 'ST' undeclared (first use in this function)
    |    if (strcasestr(buf,"STi") || strcasestr(buf,"STx")) stb_type=ST;
    |                                                                 ^
    | /home/ubuntu/openatv/build-enviroment/builds/openatv/spark/tmp/work/sh4-oe-linux/aio-grab/1.0+gitAUTOINC+6868d24b4f-r2/git/main.c:191:64: note: each undeclared identifier is reported only once for each function it appears in
    | /home/ubuntu/openatv/build-enviroment/builds/openatv/spark/tmp/work/sh4-oe-linux/aio-grab/1.0+gitAUTOINC+6868d24b4f-r2/git/main.c: In function 'getvideo':
    | /home/ubuntu/openatv/build-enviroment/builds/openatv/spark/tmp/work/sh4-oe-linux/aio-grab/1.0+gitAUTOINC+6868d24b4f-r2/git/main.c:1097:23: error: 'ST' undeclared (first use in this function)
    |   else if (stb_type == ST)
    |                        ^
    | make: *** [grab-main.o] Error 1
    Kann es ein, dass da ein Patch nicht mehr funktioniert? Danke und Gruß,

    •   Alt Advertising

       

  2. #92
    Mitglied
    Registriert seit
    02.10.2013
    Beiträge
    50
    Total Downloaded
    0
    Total Downloaded
    0
    ReceiverDankeAktivitäten
    Box 1:
    Golden Media Reloaded SPARK
     
     
    MACHINE=sparkreloaded DISTRO=openatv make image

    | collect2: error: ld returned 1 exit status| make[1]: *** [cc1] Error 1
    | make[1]: Leaving directory `/home/pop1234/Desktop/openatv/build-enviroment/builds/openatv/spark/tmp/work/x86_64-oe-linux/gcc-cross-initial-sh4/4.8.2-r0/gcc-4.8.2/build.x86_64-linux.sh4-oe-linux/gcc'
    | make: *** [all-gcc] Error 2
    | ERROR: oe_runmake failed
    | WARNING: /home/pop1234/Desktop/openatv/build-enviroment/builds/openatv/spark/tmp/work/x86_64-oe-linux/gcc-cross-initial-sh4/4.8.2-r0/temp/run.do_compile.4075:1 exit 1 from
    | exit 1
    | ERROR: Function failed: do_compile (log file is located at /home/pop1234/Desktop/openatv/build-enviroment/builds/openatv/spark/tmp/work/x86_64-oe-linux/gcc-cross-initial-sh4/4.8.2-r0/temp/log.do_compile.4075)

    ERROR: Task 481 (/home/pop1234/Desktop/openatv/build-enviroment/openembedded-core/meta/recipes-devtools/gcc/gcc-cross-initial_4.8.bb, do_compile) failed with exit code '1'

    Golden Media Reloaded SPARK Sti7111

  3. #93
    Avatar von Captain
    Registriert seit
    03.04.2013
    Beiträge
    10.203
    Themenstarter
    Total Downloaded
    162,35 MB
    Total Downloaded
    162,35 MB
    ReceiverDankeAktivitäten
    gehe in dein build ordner und mach mal

    make update

    du hast die letzten updates nicht geholt

  4. #94
    Mitglied
    Registriert seit
    02.10.2013
    Beiträge
    50
    Total Downloaded
    0
    Total Downloaded
    0
    ReceiverDankeAktivitäten
    Box 1:
    Golden Media Reloaded SPARK
     
     
    this window Show me in new tab terminal

    *** Manual patch resolution mode ***Dropping to a shell, so patch rejects can be fixed manually.
    Run "quilt refresh" when patch is corrected, press CTRL+D to exit.


    File series fully applied, ends at patch Binary
    pop1234@ubuntu:~/Desktop/openatv/build-enviroment/builds/openatv/spark/tmp/work/sh4-oe-linux/autofs/5.0.7-r6/autofs-5.0.7$

    Golden Media Reloaded SPARK Sti7111

  5. #95
    Mitglied
    Registriert seit
    02.10.2013
    Beiträge
    50
    Total Downloaded
    0
    Total Downloaded
    0
    ReceiverDankeAktivitäten
    Box 1:
    Golden Media Reloaded SPARK
     
     
    and this error

    | collect2: error: ld returned 1 exit status| make[2]: *** [bin/cpack] Error 1
    | make[1]: *** [Source/CMakeFiles/cpack.dir/all] Error 2
    | Linking CXX static library libCTestLib.a
    | [ 96%] Built target CTestLib
    | make: *** [all] Error 2
    | ERROR: oe_runmake failed
    | WARNING: /home/pop1234/Desktop/openatv/build-enviroment/builds/openatv/spark/tmp/work/x86_64-linux/cmake-native/2.8.12.2-r0/temp/run.do_compile.3785:1 exit 1 from
    | exit 1
    | ERROR: Function failed: do_compile (log file is located at /home/pop1234/Desktop/openatv/build-enviroment/builds/openatv/spark/tmp/work/x86_64-linux/cmake-native/2.8.12.2-r0/temp/log.do_compile.3785)
    ERROR: Task 3932 (/home/pop1234/Desktop/openatv/build-enviroment/openembedded-core/meta/recipes-devtools/cmake/cmake-native_2.8.12.2.bb, do_compile) failed with exit code '1'

    Golden Media Reloaded SPARK Sti7111

  6. #96
    Anfänger
    Registriert seit
    24.04.2014
    Beiträge
    12
    Total Downloaded
    0
    Total Downloaded
    0
    ReceiverDankeAktivitäten
    Kubuntu 12.04 64bit

    compile openatv 4.2


    Code:
    Updating Git repositories...
    Already up-to-date.
    Synchronizing submodule url for 'bitbake'
    Synchronizing submodule url for 'meta-oe-alliance'
    Synchronizing submodule url for 'meta-openembedded'
    Synchronizing submodule url for 'openembedded-core'
    Submodule 'bitbake' () registered for path 'bitbake'
    Submodule 'meta-oe-alliance' () registered for path 'meta-oe-alliance'
    Submodule 'meta-openembedded' () registered for path 'meta-openembedded'
    Submodule 'openembedded-core' () registered for path 'openembedded-core'
    Synchronizing submodule url for 'meta-oe/recipes-oe-alliance/enigma2-plugins/e2openplugins'
    Submodule 'meta-oe/recipes-oe-alliance/enigma2-plugins/e2openplugins' () registered for path 'meta-oe/recipes-oe-alliance/enigma2-plugins/e2openplugins'
    The oe-alliance is now up-to-date.
    Loading cache: 100% |########################################################################################################################################################| ETA:  00:00:00
    Loaded 2723 entries from dependency cache.
    WARNING: Unable to get checksum for linux-etxx00 SRC_URI entry defconfig: file could not be found                                                                            | ETA:  --:--:--
    WARNING: Unable to get checksum for linux-etxx00 SRC_URI entry defconfig: file could not be found
    WARNING: Unable to get checksum for linux-etxx00 SRC_URI entry defconfig: file could not be found
    WARNING: Unable to get checksum for linux-vuplus SRC_URI entry defconfig: file could not be found                                                                            | ETA:  00:01:28
    WARNING: Unable to get checksum for linux-vuplus SRC_URI entry defconfig: file could not be found
    WARNING: Unable to get checksum for linux-skylake SRC_URI entry defconfig: file could not be found                                                                           | ETA:  00:00:53
    WARNING: Unable to get checksum for odin-backup SRC_URI entry odin-backup.sh: file could not be found
    WARNING: Unable to get checksum for linux-odin SRC_URI entry defconfig: file could not be found
    WARNING: Unable to get checksum for linux-odin SRC_URI entry spark-board.patch: file could not be found
    WARNING: Unable to get checksum for linux-ixuss SRC_URI entry defconfig: file could not be found                                                                             | ETA:  00:00:46
    WARNING: Unable to get checksum for linux-ini-hdp SRC_URI entry defconfig: file could not be found                                                                           | ETA:  00:00:41
    WARNING: Unable to get checksum for linux-ini-hdx SRC_URI entry defconfig: file could not be found
    WARNING: Unable to get checksum for linux-ini-hde2 SRC_URI entry defconfig: file could not be found                                                                          | ETA:  00:00:35
    WARNING: Unable to get checksum for gigablue-ethwol SRC_URI entry ethwol.sh: file could not be found
    WARNING: Unable to get checksum for linux-ini-hde SRC_URI entry defconfig: file could not be found
    WARNING: Unable to get checksum for gigablue-dvb-modules-gb800ue SRC_URI entry ddbootup: file could not be found                                                             | ETA:  00:00:32
    WARNING: Unable to get checksum for gigablue-dvb-modules-gb800seplus SRC_URI entry ddbootup: file could not be found                                                         | ETA:  00:00:34
    WARNING: Unable to get checksum for gigablue-dvb-modules-gbquad SRC_URI entry ddbootup: file could not be found                                                              | ETA:  00:00:30
    WARNING: Unable to get checksum for gigablue-dvb-modules-gbquadplus SRC_URI entry ddbootup: file could not be found
    WARNING: Unable to get checksum for gigablue-dvb-modules-gbipbox SRC_URI entry ddbootup: file could not be found
    WARNING: Unable to get checksum for gigablue-dvb-modules-gb800solo SRC_URI entry ddbootup: file could not be found
    WARNING: Unable to get checksum for gigablue-dvb-modules-gb800ueplus SRC_URI entry ddbootup: file could not be found                                                         | ETA:  00:00:28
    WARNING: Unable to get checksum for gigablue-dvb-modules-gb800se SRC_URI entry ddbootup: file could not be found
    WARNING: Unable to get checksum for linux-gigablue SRC_URI entry defconfig: file could not be found
    WARNING: Unable to get checksum for linux-gigablue SRC_URI entry defconfig: file could not be found                                                                          | ETA:  00:00:27
    WARNING: Unable to get checksum for linux-formuler SRC_URI entry defconfig: file could not be found
    WARNING: Unable to get checksum for linux-ebox SRC_URI entry defconfig: file could not be found
    WARNING: Unable to get checksum for linux-entwopia SRC_URI entry defconfig: file could not be found                                                                          | ETA:  00:00:28
    WARNING: Unable to get checksum for dreambox-dvb-modules-dm8000 SRC_URI entry modules: file could not be found
    WARNING: Unable to get checksum for dreambox-dvb-modules-dm7020hd SRC_URI entry modules: file could not be found
    WARNING: Unable to get checksum for dreambox-dvb-modules-dm800se SRC_URI entry modules: file could not be found                                                              | ETA:  00:00:27
    WARNING: Unable to get checksum for dreambox-dvb-modules-dm500hd SRC_URI entry modules: file could not be found
    WARNING: Unable to get checksum for dreambox-dvb-modules-dm500hdv2 SRC_URI entry modules: file could not be found                                                            | ETA:  00:00:26
    WARNING: Unable to get checksum for dreambox-dvb-modules-dm800sev2 SRC_URI entry modules: file could not be found
    WARNING: Unable to get checksum for dreambox-enigma2-config SRC_URI entry skin_box.xml: file could not be found                                                              | ETA:  00:00:24
    WARNING: Unable to get checksum for linux-dreambox SRC_URI entry defconfig: file could not be found
    WARNING: Unable to get checksum for linux-dags SRC_URI entry defconfig: file could not be found                                                                              | ETA:  00:00:24
    WARNING: Unable to get checksum for linux-cube SRC_URI entry defconfig: file could not be found
    WARNING: Unable to get checksum for linux-blackbox SRC_URI entry defconfig: file could not be found
    WARNING: Unable to get checksum for linux-azbox SRC_URI entry defconfig: file could not be found                                                                             | ETA:  00:00:22
    WARNING: Unable to get checksum for linux-azbox SRC_URI entry defconfig: file could not be found
    WARNING: Unable to get checksum for ghostscript SRC_URI entry objarch.h: file could not be found#######################################################################      | ETA:  00:00:01
    WARNING: Unable to get checksum for libart-lgpl SRC_URI entry art_config.h: file could not be found
    WARNING: Unable to get checksum for graphlcd-base SRC_URI entry graphlcd.conf: file could not be found##################################################################     | ETA:  00:00:01
    WARNING: Unable to get checksum for graphlcd-base SRC_URI entry glcd-mipsel.patch: file could not be found
    WARNING: Unable to get checksum for graphlcd-base SRC_URI entry glcd-vuduo2.patch: file could not be found
    Parsing recipes: 100% |######################################################################################################################################################| ETA:  00:00:00
    Parsing of 2514 .bb files complete (2193 cached, 321 parsed). 3000 targets, 108 skipped, 0 masked, 0 errors.
    NOTE: Resolving any missing task queue dependencies
    
    
    Build Configuration:
    BB_VERSION        = "1.23.1"
    BUILD_SYS         = "x86_64-linux"
    NATIVELSBSTRING   = "Ubuntu-12.04"
    TARGET_SYS        = "sh4-oe-linux"
    MACHINE           = "spark"
    DISTRO            = "openatv"
    DISTRO_VERSION    = "4.2"
    TUNE_FEATURES     = "sh4"
    meta              = "(nobranch):4321c553d5ae816e566234e981a0815bba046d39"
    meta-oe           
    meta-multimedia   
    meta-networking   
    meta-filesystems  
    meta-python       = "(nobranch):4d4ab8fd320b58323033c12cf705e7b3ce10d659"
    meta-oe           
    meta-azbox        
    meta-blackbox     
    meta-cube         
    meta-dags         
    meta-dream        
    meta-ebox         
    meta-entwopia     
    meta-formuler     
    meta-gigablue     
    meta-ini          
    meta-ixuss        
    meta-odin         
    meta-skylake      
    meta-vuplus       
    meta-xp           
    meta-xtrend       
    meta-fulan        = "(nobranch):5b4a4d61c6e00b1fe321617c0d7d1adc44659554"
    
    
    NOTE: Preparing runqueue
    NOTE: Executing SetScene Tasks
    NOTE: Executing RunQueue Tasks
    ERROR: Function failed: do_compile (log file is located at /home/tas/openatv/build-enviroment/builds/openatv/spark/tmp/work/spark-oe-linux/lirc/0.9.0-r13.4/temp/log.do_compile.11671)
    ERROR: Logfile of failure stored in: /home/tas/openatv/build-enviroment/builds/openatv/spark/tmp/work/spark-oe-linux/lirc/0.9.0-r13.4/temp/log.do_compile.11671
    Log data follows:
    | DEBUG: SITE files ['endian-little', 'bit-32', 'sh-common', 'common-linux', 'common-glibc', 'sh4-linux', 'common']
    | DEBUG: Executing shell function do_compile
    | NOTE: make SUBDIRS=daemons tools
    | make  all-recursive
    | make[1]: Entering directory `/home/tas/openatv/build-enviroment/builds/openatv/spark/tmp/work/spark-oe-linux/lirc/0.9.0-r13.4/build'
    | Making all in daemons
    | make[2]: Entering directory `/home/tas/openatv/build-enviroment/builds/openatv/spark/tmp/work/spark-oe-linux/lirc/0.9.0-r13.4/build/daemons'
    | make  all-am
    | make[3]: Entering directory `/home/tas/openatv/build-enviroment/builds/openatv/spark/tmp/work/spark-oe-linux/lirc/0.9.0-r13.4/build/daemons'
    | ../sh4-oe-linux-libtool  --tag=CC   --mode=link sh4-oe-linux-gcc  -ml -m4 --sysroot=/home/tas/openatv/build-enviroment/builds/openatv/spark/tmp/sysroots/spark  -Os -pipe -g -feliminate-unused-debug-types -DUINPUT_NEUTRINO_HACK        -Wl,-O1 -Wl,--hash-style=gnu -Wl,--as-needed -o irrecord irrecord.o config_file.o dump_config.o input_map.o transmit.o libhw_module.a -lasound -L/usr/lib/x86_64-linux-gnu -lusb -L/usr/lib/x86_64-linux-gnu -lusb  -L/usr/lib/x86_64-linux-gnu -lusb -L/usr/lib/x86_64-linux-gnu -lusb     -L/usr/lib/x86_64-linux-gnu -lusb -lpthread
    | sh4-oe-linux-libtool: link: sh4-oe-linux-gcc -ml -m4 --sysroot=/home/tas/openatv/build-enviroment/builds/openatv/spark/tmp/sysroots/spark -Os -pipe -g -feliminate-unused-debug-types -DUINPUT_NEUTRINO_HACK -Wl,-O1 -Wl,--hash-style=gnu -Wl,--as-needed -o irrecord irrecord.o config_file.o dump_config.o input_map.o transmit.o  libhw_module.a /home/tas/openatv/build-enviroment/builds/openatv/spark/tmp/sysroots/spark/usr/lib/libasound.so -L/usr/lib/x86_64-linux-gnu -lusb -lpthread
    | /home/tas/openatv/build-enviroment/builds/openatv/spark/tmp/sysroots/x86_64-linux/usr/libexec/sh4-oe-linux/gcc/sh4-oe-linux/4.8.2/ld: warning: library search path "/usr/lib/x86_64-linux-gnu" is unsafe for cross-compilation
    | /usr/lib/x86_64-linux-gnu/libusb.so: file not recognized: File format not recognized
    | collect2: error: ld returned 1 exit status
    | make[3]: *** [irrecord] Error 1
    | make[3]: Leaving directory `/home/tas/openatv/build-enviroment/builds/openatv/spark/tmp/work/spark-oe-linux/lirc/0.9.0-r13.4/build/daemons'
    | make[2]: *** [all] Error 2
    | make[2]: Leaving directory `/home/tas/openatv/build-enviroment/builds/openatv/spark/tmp/work/spark-oe-linux/lirc/0.9.0-r13.4/build/daemons'
    | make[1]: *** [all-recursive] Error 1
    | make[1]: Leaving directory `/home/tas/openatv/build-enviroment/builds/openatv/spark/tmp/work/spark-oe-linux/lirc/0.9.0-r13.4/build'
    | make: *** [all] Error 2
    | ERROR: oe_runmake failed
    | WARNING: /home/tas/openatv/build-enviroment/builds/openatv/spark/tmp/work/spark-oe-linux/lirc/0.9.0-r13.4/temp/run.do_compile.11671:1 exit 1 from
    |   exit 1
    | ERROR: Function failed: do_compile (log file is located at /home/tas/openatv/build-enviroment/builds/openatv/spark/tmp/work/spark-oe-linux/lirc/0.9.0-r13.4/temp/log.do_compile.11671)
    ERROR: Task 5076 (/home/tas/openatv/build-enviroment/meta-oe-alliance/meta-oe/recipes-extended/lirc/lirc_0.9.0.bb, do_compile) failed with exit code '1'
    NOTE: Tasks Summary: Attempted 9144 tasks of which 9124 didn't need to be rerun and 1 failed.
    Waiting for 0 running tasks to finish:
    
    
    Summary: 1 task failed:
      /home/tas/openatv/build-enviroment/meta-oe-alliance/meta-oe/recipes-extended/lirc/lirc_0.9.0.bb, do_compile
    Summary: There were 46 WARNING messages shown.
    Summary: There was 1 ERROR message shown, returning a non-zero exit code.
    make: *** [image] Błąd 1

















    error: log



    Code:
    DEBUG: SITE files ['endian-little', 'bit-32', 'sh-common', 'common-linux', 'common-glibc', 'sh4-linux', 'common']DEBUG: Executing shell function do_compile
    NOTE: make SUBDIRS=daemons tools
    make  all-recursive
    make[1]: Entering directory `/home/tas/openatv/build-enviroment/builds/openatv/spark/tmp/work/spark-oe-linux/lirc/0.9.0-r13.4/build'
    Making all in daemons
    make[2]: Entering directory `/home/tas/openatv/build-enviroment/builds/openatv/spark/tmp/work/spark-oe-linux/lirc/0.9.0-r13.4/build/daemons'
    make  all-am
    make[3]: Entering directory `/home/tas/openatv/build-enviroment/builds/openatv/spark/tmp/work/spark-oe-linux/lirc/0.9.0-r13.4/build/daemons'
    ../sh4-oe-linux-libtool  --tag=CC   --mode=link sh4-oe-linux-gcc  -ml -m4 --sysroot=/home/tas/openatv/build-enviroment/builds/openatv/spark/tmp/sysroots/spark  -Os -pipe -g -feliminate-unused-debug-types -DUINPUT_NEUTRINO_HACK        -Wl,-O1 -Wl,--hash-style=gnu -Wl,--as-needed -o irrecord irrecord.o config_file.o dump_config.o input_map.o transmit.o libhw_module.a -lasound -L/usr/lib/x86_64-linux-gnu -lusb -L/usr/lib/x86_64-linux-gnu -lusb  -L/usr/lib/x86_64-linux-gnu -lusb -L/usr/lib/x86_64-linux-gnu -lusb     -L/usr/lib/x86_64-linux-gnu -lusb -lpthread  
    sh4-oe-linux-libtool: link: sh4-oe-linux-gcc -ml -m4 --sysroot=/home/tas/openatv/build-enviroment/builds/openatv/spark/tmp/sysroots/spark -Os -pipe -g -feliminate-unused-debug-types -DUINPUT_NEUTRINO_HACK -Wl,-O1 -Wl,--hash-style=gnu -Wl,--as-needed -o irrecord irrecord.o config_file.o dump_config.o input_map.o transmit.o  libhw_module.a /home/tas/openatv/build-enviroment/builds/openatv/spark/tmp/sysroots/spark/usr/lib/libasound.so -L/usr/lib/x86_64-linux-gnu -lusb -lpthread
    /home/tas/openatv/build-enviroment/builds/openatv/spark/tmp/sysroots/x86_64-linux/usr/libexec/sh4-oe-linux/gcc/sh4-oe-linux/4.8.2/ld: warning: library search path "/usr/lib/x86_64-linux-gnu" is unsafe for cross-compilation
    /usr/lib/x86_64-linux-gnu/libusb.so: file not recognized: File format not recognized
    collect2: error: ld returned 1 exit status
    make[3]: *** [irrecord] Error 1
    make[3]: Leaving directory `/home/tas/openatv/build-enviroment/builds/openatv/spark/tmp/work/spark-oe-linux/lirc/0.9.0-r13.4/build/daemons'
    make[2]: *** [all] Error 2
    make[2]: Leaving directory `/home/tas/openatv/build-enviroment/builds/openatv/spark/tmp/work/spark-oe-linux/lirc/0.9.0-r13.4/build/daemons'
    make[1]: *** [all-recursive] Error 1
    make[1]: Leaving directory `/home/tas/openatv/build-enviroment/builds/openatv/spark/tmp/work/spark-oe-linux/lirc/0.9.0-r13.4/build'
    make: *** [all] Error 2
    ERROR: oe_runmake failed
    WARNING: /home/tas/openatv/build-enviroment/builds/openatv/spark/tmp/work/spark-oe-linux/lirc/0.9.0-r13.4/temp/run.do_compile.11671:1 exit 1 from
      exit 1
    ERROR: Function failed: do_compile (log file is located at /home/tas/openatv/build-enviroment/builds/openatv/spark/tmp/work/spark-oe-linux/lirc/0.9.0-r13.4/temp/log.do_compile.11671)
    Geändert von comag (17.08.2014 um 21:31 Uhr)

  7. #97
    Avatar von Captain
    Registriert seit
    03.04.2013
    Beiträge
    10.203
    Themenstarter
    Total Downloaded
    162,35 MB
    Total Downloaded
    162,35 MB
    ReceiverDankeAktivitäten
    hier keine Probleme

    Ubunto 12_4 64 Bit

    gestern alles neu gebaut sh4 von null

  8. #98
    Anfänger
    Registriert seit
    24.04.2014
    Beiträge
    12
    Total Downloaded
    0
    Total Downloaded
    0
    ReceiverDankeAktivitäten
    ja ich weiß, ich komplett neu bauen.

  9. #99
    Mitglied
    Registriert seit
    26.01.2014
    Beiträge
    38
    Total Downloaded
    14,51 MB
    Total Downloaded
    14,51 MB
    ReceiverDankeAktivitäten
    Zitat Zitat von Captain Beitrag anzeigen
    hier keine Probleme
    Ubunto 12_4 64 Bit
    gestern alles neu gebaut sh4 von null
    Can you build it without the openssl-old_0.9.8x <-> libcrypto-compat-0.9.8 swap on Ubuntu 12_4 ?
    ps. tpmd_1.0.bb also needs to be edited just like openatv-feeds.bb

    I ran into some perl problems building openssl-old_0.9.8x, these can be fixed with:
    sudo apt-get install libproc-processtable-perl
    sudo apt-get install libperl4-corelibs-perl

    But after I installed these I still get an error:
    Code:
    | c_rehash.pod around line 45: You forgot a '=back' before '=head1'
    | c_rehash.pod around line 49: =back without =over
    | POD document had syntax errors at /usr/bin/pod2man line 71.
    | make: *** [install_docs] Error 255
    | ERROR: oe_runmake failed
    | WARNING: exit code 1 from a shell command.
    | ERROR: Function failed: do_install (log file is located at /home/gertjan/oe-alliance.23/builds/openatv/dm800se/tmp/work/mips32el-oe-linux/openssl-old/0.9.8x-r15.0/temp/log.do_install.1975)
    ERROR: Task 2 (/home/gertjan/oe-alliance.23/meta-oe-alliance/meta-oe/recipes-connectivity/openssl/openssl-old_0.9.8x.bb, do_install) failed with exit code '1'

  10. #100
    Avatar von Captain
    Registriert seit
    03.04.2013
    Beiträge
    10.203
    Themenstarter
    Total Downloaded
    162,35 MB
    Total Downloaded
    162,35 MB
    ReceiverDankeAktivitäten
    no openssl 0.98 is needed for old rtmpdump and this is needed for mediaportal , then we remove many user are crying

    this issue comes from your host system then perl on your system is to new, downgrade to older version, you find many infos about this issue in internet

    we build on ubunto 12_04 and have no issue, or you find a patch we can include


Seite 10 von 38 ErsteErste ... 8910111220 ... LetzteLetzte

Stichworte

Lesezeichen

Berechtigungen

  • Neue Themen erstellen: Nein
  • Themen beantworten: Nein
  • Anhänge hochladen: Nein
  • Beiträge bearbeiten: Nein
  •  
Diese Website benutzt Cookies
Wir benutzen Cookies um Sitzungsinformationen zu speichern. Dies erleichtert es uns z.B. Dich an Deine Login zu erinnern, Einstellungen der Webseite zu speichern, Inhalte und Werbung zu personalisieren, Social Media Funktionen anzubieten und unser Datenaufkommen zu analysieren. Wir teilen diese Informationen ebenfalls mit unseren Social Media-, Werbe- und Analysepartnern.
     
Alle Zeitangaben in WEZ +1. Es ist jetzt 11:59 Uhr.
Powered by vBulletin® Version 4.2.3 (Deutsch)
Copyright ©2017 Adduco Digital e.K. und vBulletin Solutions, Inc. Alle Rechte vorbehalten.
Resources saved on this page: MySQL 5,88%
Parts of this site powered by vBulletin Mods & Addons from DragonByte Technologies Ltd. (Details)
vBulletin Skin By: PurevB.com