Thanks Thanks:  1
Ergebnis 1 bis 7 von 7
  1. #1
    Anfänger
    Registriert seit
    19.04.2013
    Beiträge
    2
    Total Downloaded
    560,5 KB
    Total Downloaded
    560,5 KB
    ReceiverDankeAktivitäten

    OpenAtv compile error?

    OEAlliance Build error




    I tried to do but IMG error,if anyone can help, where is the problem?

    Thank you very much!




    openatv2@openatv2:~/build-enviroment$ MACHINE=DM800se DISTRO=openatv make image
    Generating /home/openatv2/build-enviroment/builds/openatv/env.source
    Generating /home/openatv2/build-enviroment/builds/openatv/conf/openatv.conf
    Generating /home/openatv2/build-enviroment/builds/openatv/conf/bblayers.conf
    ERROR: Traceback (most recent call last):
    File "/home/openatv2/build-enviroment/bitbake/lib/bb/cookerdata.py", line 163, in wrapped
    return func(fn, *args)
    File "/home/openatv2/build-enviroment/bitbake/lib/bb/cookerdata.py", line 173, in parse_config_file
    return bb.parse.handle(fn, data, include)
    File "/home/openatv2/build-enviroment/bitbake/lib/bb/parse/__init__.py", line 102, in handle
    return h['handle'](fn, data, include)
    File "/home/openatv2/build-enviroment/bitbake/lib/bb/parse/parse_py/ConfHandler.py", line 120, in handle
    abs_fn = resolve_file(fn, data)
    File "/home/openatv2/build-enviroment/bitbake/lib/bb/parse/__init__.py", line 125, in resolve_file
    raise IOError("file %s not found" % fn)
    IOError: file /home/openatv2/build-enviroment/meta-oe-alliance/conf/layer.conf not found

    ERROR: Unable to parse /home/openatv2/build-enviroment/meta-oe-alliance/conf/layer.conf: file /home/openatv2/build-enviroment/meta-oe-alliance/conf/layer.conf not found
    make: *** [image] Error 1
    openatv2@openatv2:~/build-enviroment$

    •   Alt Advertising

       

  2. #2
    Avatar von Captain
    Registriert seit
    03.04.2013
    Beiträge
    10.766
    Total Downloaded
    162,35 MB
    Total Downloaded
    162,35 MB
    ReceiverDankeAktivitäten
    you have PN

  3. Thanks crnipauk bedankten sich
  4. #3
    Anfänger
    Registriert seit
    19.07.2014
    Beiträge
    6
    Total Downloaded
    0
    Total Downloaded
    0
    ReceiverDankeAktivitäten
    Have the same error ... :-(

    Code:
    [user@localhost build-enviroment]$ make MACHINE=gbquadplus DISTRO=openatv image
    ERROR: Traceback (most recent call last):
      File "/home/user/projects/force1/build-enviroment/bitbake/lib/bb/cookerdata.py", line 163, in wrapped
        return func(fn, *args)
      File "/home/user/projects/force1/build-enviroment/bitbake/lib/bb/cookerdata.py", line 173, in parse_config_file
        return bb.parse.handle(fn, data, include)
      File "/home/user/projects/force1/build-enviroment/bitbake/lib/bb/parse/__init__.py", line 102, in handle
        return h['handle'](fn, data, include)
      File "/home/user/projects/force1/build-enviroment/bitbake/lib/bb/parse/parse_py/ConfHandler.py", line 120, in handle
        abs_fn = resolve_file(fn, data)
      File "/home/user/projects/force1/build-enviroment/bitbake/lib/bb/parse/__init__.py", line 125, in resolve_file
        raise IOError("file %s not found" % fn)
    IOError: file /home/user/projects/force1/build-enviroment/meta-oe-alliance/conf/layer.conf not found
    
    ERROR: Unable to parse /home/user/projects/force1/build-enviroment/meta-oe-alliance/conf/layer.conf: file /home/user/projects/force1/build-enviroment/meta-oe-alliance/conf/layer.conf not found
    How can i fix this one ?

  5. #4

    Registriert seit
    11.07.2013
    Beiträge
    533
    Total Downloaded
    31,12 MB
    Total Downloaded
    31,12 MB
    ReceiverDankeAktivitäten
    Box 1:
    Octagon SF3038 SST
     
     
    Box 2:
    Azbox ME
     
     
    Hi Captain, same error here. can you please advise?

  6. #5
    Avatar von arn354
    Registriert seit
    06.04.2013
    Beiträge
    2.651
    Total Downloaded
    147,3 KB
    Total Downloaded
    147,3 KB
    ReceiverDankeAktivitäten
    "git clone" does not include the correct makefile for branch 2.2 - it is not yet publically released.
    chat with captain
    Grüßle


  7. #6
    Anfänger
    Registriert seit
    19.07.2014
    Beiträge
    6
    Total Downloaded
    0
    Total Downloaded
    0
    ReceiverDankeAktivitäten
    Zitat Zitat von arn354 Beitrag anzeigen
    "git clone" does not include the correct makefile for branch 2.2 - it is not yet publically released.
    chat with captain
    Ok, then how can we compile version early 2.2 available on Git ?

    Thanks!

  8. #7
    Anfänger
    Registriert seit
    06.04.2013
    Beiträge
    1
    Total Downloaded
    0
    Total Downloaded
    0
    ReceiverDankeAktivitäten
    Hello Captain, I have the same error can you guide me?


Stichworte

Lesezeichen

Berechtigungen

  • Neue Themen erstellen: Nein
  • Themen beantworten: Nein
  • Anhänge hochladen: Nein
  • Beiträge bearbeiten: Nein
  •  
Diese Website benutzt Cookies
Wir benutzen Cookies um Sitzungsinformationen zu speichern. Dies erleichtert es uns z.B. Dich an Deine Login zu erinnern, Einstellungen der Webseite zu speichern, Inhalte und Werbung zu personalisieren, Social Media Funktionen anzubieten und unser Datenaufkommen zu analysieren. Wir teilen diese Informationen ebenfalls mit unseren Social Media-, Werbe- und Analysepartnern.
     
Alle Zeitangaben in WEZ +1. Es ist jetzt 23:49 Uhr.
Powered by vBulletin® Version 4.2.5 (Deutsch)
Copyright ©2017 Adduco Digital e.K. und vBulletin Solutions, Inc. Alle Rechte vorbehalten.
Resources saved on this page: MySQL 10,00%
Parts of this site powered by vBulletin Mods & Addons from DragonByte Technologies Ltd. (Details)
vBulletin Skin By: PurevB.com