Thanks Thanks:  11
Seite 5 von 7 ErsteErste ... 34567 LetzteLetzte
Ergebnis 41 bis 50 von 69
  1. #41
    Avatar von mcron
    Registriert seit
    06.04.2013
    Ort
    FFM
    Beiträge
    143
    Total Downloaded
    14,43 MB
    Total Downloaded
    14,43 MB
    ReceiverDankeAktivitäten
    Box 1:
    Venton hd3
     
     
    Box 2:
    Vizyon 820hd
     
     
    Box 3:
    IPBOX99hd
     
     
    Box 4:
    IPBOX55hd
     
     
    Box 5:
    Dreambox 5620S
     
     
    glaube ich dir...hier hats wohl mein g++ zerschossen
    habe mal alles neu aufgesetzt

    •   Alt Advertising

       

  2. #42
    Avatar von mcron
    Registriert seit
    06.04.2013
    Ort
    FFM
    Beiträge
    143
    Total Downloaded
    14,43 MB
    Total Downloaded
    14,43 MB
    ReceiverDankeAktivitäten
    Box 1:
    Venton hd3
     
     
    Box 2:
    Vizyon 820hd
     
     
    Box 3:
    IPBOX99hd
     
     
    Box 4:
    IPBOX55hd
     
     
    Box 5:
    Dreambox 5620S
     
     
    so da ich alles neu machen musste bleibt nun bei libungif stehen....immer wieder was neues

    | /home/mcron/build-enviroment/builds/swf/ventonhdx/tmp/sysroots/x86_64-linux/usr/libexec/mips32el-oe-linux/gcc/mipsel-oe-linux/4.6.4/ld: cannot find -lSM
    | collect2: ld returned 1 exit status
    | make[2]: *** [libungif.la] Error 1
    | make[2]: Leaving directory `/home/mcron/build-enviroment/builds/swf/ventonhdx/tmp/work/mips32el-oe-linux/libungif-4.1.3-r3/libungif-4.1.3/lib'
    | make[1]: *** [all-recursive] Error 1
    | make[1]: Leaving directory `/home/mcron/build-enviroment/builds/swf/ventonhdx/tmp/work/mips32el-oe-linux/libungif-4.1.3-r3/libungif-4.1.3'
    | make: *** [all] Error 2
    | ERROR: oe_runmake failed
    NOTE: package libungif-4.1.3-r3: task do_compile: Failed
    ERROR: Task 3663 (/home/mcron/build-enviroment/meta-oe-alliance/recipes-multimedia/libungif/libungif_4.1.3.bb, do_compile) failed with exit code '1'
    Waiting for 1 running tasks to finish:
    0: util-linux-2.21-r5 do_configure (pid 28169)
    NOTE: package util-linux-2.21-r5: task do_configure: Succeeded
    NOTE: Tasks Summary: Attempted 2245 tasks of which 2239 didn't need to be rerun and 1 failed.

  3. #43
    Avatar von mcron
    Registriert seit
    06.04.2013
    Ort
    FFM
    Beiträge
    143
    Total Downloaded
    14,43 MB
    Total Downloaded
    14,43 MB
    ReceiverDankeAktivitäten
    Box 1:
    Venton hd3
     
     
    Box 2:
    Vizyon 820hd
     
     
    Box 3:
    IPBOX99hd
     
     
    Box 4:
    IPBOX55hd
     
     
    Box 5:
    Dreambox 5620S
     
     
    so nachdem es nun klappte mit dem image bauen, habe ich heute morgen nochmal ein neues versucht.
    habe den pc nicht runter gefahren, bur nen make update und schwupps kommt wieder mal was neues

    | autoreconf: running: automake --foreign --add-missing --copy --force-missing --warnings=cross
    | automake: unknown warning category `cross'
    | configure.ac:14: installing `./config.guess'
    | configure.ac:14: installing `./config.sub'
    | configure.ac:2: installing `./install-sh'
    | configure.ac:2: installing `./missing'
    | 3GModemManager/src/Makefile.am:5: installing `./py-compile'
    | AutoERROR: Function failed: do_configure (see /home/mcron/build-enviroment/builds/swf/ventonhdx/tmp/work/ventonhdx-oe-linux/enigma2-oe-alliance-plugins-git3+d9f01aba36215dc42925672d35ada7127018daa6-r82/temp/log.do_configure.21736 for further information)
    | BouquetsMaker/lib/Makefile.am: installing `./depcomp'
    | OpenUitzendingGemist/src/Makefile.am:1: bad characters in variable name `installdir'
    | OpenUitzendingGemist/src/Makefile.am:3: `install_PYTHON' is used but `installdir' is undefined
    | autoreconf: automake failed with exit status: 1
    | ERROR: autoreconf execution failed.
    NOTE: package enigma2-oe-alliance-plugins-git3+d9f01aba36215dc42925672d35ada7127018daa6-r82: task do_configure: Failed
    ERROR: Task 125 (/home/mcron/build-enviroment/meta-oe-alliance/recipes-oe-alliance/enigma2-plugins/enigma2-oe-alliance-plugins.bb, do_configure) failed with exit code '1'
    Waiting for 1 running tasks to finish:
    0: enigma2-plugins-git3+151de64308ed6bb7d76940b8272ec6b234d8b744-r35 do_configure (pid 21796)

  4. #44
    Avatar von Captain
    Registriert seit
    03.04.2013
    Beiträge
    10.787
    Total Downloaded
    162,35 MB
    Total Downloaded
    162,35 MB
    ReceiverDankeAktivitäten
    das hab ich gerade gefixt im git da hat eine beim committen sich vertippt

  5. Thanks mcron bedankten sich
  6. #45
    Avatar von mcron
    Registriert seit
    06.04.2013
    Ort
    FFM
    Beiträge
    143
    Total Downloaded
    14,43 MB
    Total Downloaded
    14,43 MB
    ReceiverDankeAktivitäten
    Box 1:
    Venton hd3
     
     
    Box 2:
    Vizyon 820hd
     
     
    Box 3:
    IPBOX99hd
     
     
    Box 4:
    IPBOX55hd
     
     
    Box 5:
    Dreambox 5620S
     
     
    so wieder was neues...keine ahnung obs an meinem system liegt.
    habe mir nen neues mb mit cpu gegönnt und gleich auf linux mint 15 geupdatet

    nun bekomme ich ziemlich schnell diesen fehler

    hat einer ne idee dazu ?



    | In file included from clean-temp.h:22:0,
    | from clean-temp.c:23:
    | ./stdio.h:477:1: error: 'gets' undeclared here (not in a function)
    | \
    | # source='dup-safer-flag.c' object='dup-safer-flag.o' libtool=no
    | gcc -std=gnu99 -I. -isystem/home/ronny/build-enviroment/builds/swf/ventonhdx/tmp/sysroots/x86_64-linux/usr/include -isystem/home/ronny/build-enviroment/builds/swf/ventonhdx/tmp/sysroots/x86_64-linux/usr/include -march=native -O2 -pipe -c dup-safer-flag.c
    | make[3]: *** [clean-temp.o] Error 1
    | make[3]: *** Waiting for unfinished jobs....
    | make[3]: Leaving directory `/home/ronny/build-enviroment/builds/swf/ventonhdx/tmp/work/x86_64-linux/m4-native-1.4.16-r2/m4-1.4.16/lib'
    | make[2]: *** [all] Error 2
    | make[2]: Leaving directory `/home/ronny/build-enviroment/builds/swf/ventonhdx/tmp/work/x86_64-linux/m4-native-1.4.16-r2/m4-1.4.16/lib'
    | make[1]: *** [all-recursive] Error 1
    | make[1]: Leaving directory `/home/ronny/build-enviroment/builds/swf/ventonhdx/tmp/work/x86_64-linux/m4-native-1.4.16-r2/m4-1.4.16'
    | make: *** [all] Error 2
    | ERROR: oe_runmake failed
    NOTE: package m4-native-1.4.16-r2: task do_compile: Failed
    ERROR: Task 62 (/home/ronny/build-enviroment/openembedded-core/meta/recipes-devtools/m4/m4-native_1.4.16.bb, do_compile) failed with exit code '1'
    NOTE: Tasks Summary: Attempted 37 tasks of which 36 didn't need to be rerun and 1 failed.

    Summary: 1 task failed:
    /home/ronny/build-enviroment/openembedded-core/meta/recipes-devtools/m4/m4-native_1.4.16.bb, do_compile
    Summary: There was 1 ERROR message shown, returning a non-zero exit code.
    make: *** [image] Error 1

  7. #46
    Avatar von Captain
    Registriert seit
    03.04.2013
    Beiträge
    10.787
    Total Downloaded
    162,35 MB
    Total Downloaded
    162,35 MB
    ReceiverDankeAktivitäten
    hoffe keine haswell cpu weil dann kannst dir gleiche neues MB und neue CPU Kaufen

    der gcc 4.6.4 rennt nicht nicht mit den neuen Ivy

  8. Thanks mcron bedankten sich
  9. #47
    Avatar von betacentauri
    Registriert seit
    15.06.2013
    Beiträge
    1.573
    Total Downloaded
    1,32 MB
    Total Downloaded
    1,32 MB
    ReceiverDankeAktivitäten
    Box 1:
    ET-9200
     
     
    Box 2:
    ET-10000
     
     
    Box 3:
    ET-8500
     
     
    Box 4:
    ET-8000
     
     
    Box 5:
    Gigablue Quad+
     
     

  10. #48
    Avatar von betacentauri
    Registriert seit
    15.06.2013
    Beiträge
    1.573
    Total Downloaded
    1,32 MB
    Total Downloaded
    1,32 MB
    ReceiverDankeAktivitäten
    Box 1:
    ET-9200
     
     
    Box 2:
    ET-10000
     
     
    Box 3:
    ET-8500
     
     
    Box 4:
    ET-8000
     
     
    Box 5:
    Gigablue Quad+
     
     
    Bzw. hier ist noch ein leicht anderer Patch:
    Code:
    Index: trunk/build_dir/host/m4-1.4.16/lib/stdio.h===================================================================
    — trunk/build_dir/host/m4-1.4.16/lib/stdio.h 2013-02-12 12:41:51.705035758 +0300
    +++ trunk/build_dir/host/m4-1.4.16/lib/stdio.h 2013-02-12 12:46:01.095355727 +0300
    @@ -474,7 +474,8 @@ _GL_WARN_ON_USE (fflush, “fflush is not
    so any use of gets warrants an unconditional warning. Assume it is
    always declared, since it is required by C89. */
    #undef gets
    -_GL_WARN_ON_USE (gets, “gets is a security hole – use fgets instead”);
    +/*_GL_WARN_ON_USE (gets, “gets is a security hole – use fgets instead”);*/
    +#define gets(a) fgets( a, sizeof(*(a)), stdin)#if 1
    # if 0

  11. #49
    Avatar von mcron
    Registriert seit
    06.04.2013
    Ort
    FFM
    Beiträge
    143
    Total Downloaded
    14,43 MB
    Total Downloaded
    14,43 MB
    ReceiverDankeAktivitäten
    Box 1:
    Venton hd3
     
     
    Box 2:
    Vizyon 820hd
     
     
    Box 3:
    IPBOX99hd
     
     
    Box 4:
    IPBOX55hd
     
     
    Box 5:
    Dreambox 5620S
     
     
    also pc ist nix besonderes... amd athlon x2 250 2x2.00ghz

    nun auch wieder zurück zu ubuntu 12.10

    aber nun wieder was neues..kann so wie ich des sehe ne datei net enpackrn bzw finden



    | NOTE: Unpacking /home/mcron/build-enviroment/sources/gcc-4_6-branch_gcc.gnu.org_.svn.gcc.branches_184847_.tar.g z to /home/mcron/build-enviroment/builds/swf/ventonhdx/tmp/work-shared/gcc-4.6.3+svnr184847-r27/
    |
    | gzip: stdin: decompression OK, trailing garbage ignored
    | tar: Child returned status 2
    | tar: Error is not recoverable: exiting now
    | ERROR: Function failed: Unpack failure for URL: 'svn://gcc.gnu.org/svn/gcc/branches;module=gcc-4_6-branch;proto=http'. Unpack command PATH="/home/mcron/build-enviroment/builds/swf/ventonhdx/tmp/sysroots/x86_64-linux/usr/bin/mips32el-oe-linux:/home/mcron/build-enviroment/builds/swf/ventonhdx/tmp/sysroots/x86_64-linux/home/mcron/build-enviroment/builds/swf/ventonhdx/tmp/sysroots/x86_64-linux/usr/bin/mips32el-oe-linux.gcc-cross-initial/crossscripts:/home/mcron/build-enviroment/builds/swf/ventonhdx/tmp/sysroots/x86_64-linux/usr/sbin:/home/mcron/build-enviroment/builds/swf/ventonhdx/tmp/sysroots/x86_64-linux/usr/bin:/home/mcron/build-enviroment/builds/swf/ventonhdx/tmp/sysroots/x86_64-linux/sbin:/home/mcron/build-enviroment/builds/swf/ventonhdx/tmp/sysroots/x86_64-linux//bin:/home/mcron/build-enviroment/openembedded-core/scripts:/home/mcron/build-enviroment/bitbake/bin:/usr/lib/lightdm/lightdm:/usr/local/sbin:/usr/local/bin:/usr/sbin:/usr/bin:/sbin:/bin:/usr/games:/usr/local/games:/home/mcron/build-enviroment/openembedded-core/scripts" tar xz --no-same-owner -f /home/mcron/build-enviroment/sources/gcc-4_6-branch_gcc.gnu.org_.svn.gcc.branches_184847_.tar.g z failed with return value 2
    NOTE: package gcc-cross-initial-4.6.3+svnr184847-r27: task do_unpack: Failed
    ERROR: Task 8057 (/home/mcron/build-enviroment/openembedded-core/meta/recipes-devtools/gcc/gcc-cross-initial_4.6.bb, do_unpack) failed with exit code '1'
    Waiting for 1 running tasks to finish:
    0: mpfr-native-3.1.0-r2 do_compile (pid 29153)
    NOTE: package mpfr-native-3.1.0-r2: task do_compile: Succeeded
    NOTE: Tasks Summary: Attempted 164 tasks of which 100 didn't need to be rerun and 1 failed.


  12. #50
    Avatar von betacentauri
    Registriert seit
    15.06.2013
    Beiträge
    1.573
    Total Downloaded
    1,32 MB
    Total Downloaded
    1,32 MB
    ReceiverDankeAktivitäten
    Box 1:
    ET-9200
     
     
    Box 2:
    ET-10000
     
     
    Box 3:
    ET-8500
     
     
    Box 4:
    ET-8000
     
     
    Box 5:
    Gigablue Quad+
     
     
    Da ist komischerweise ganz hinten ein Leerzeichen im Dateinamen:
    tar xz --no-same-owner -f /home/mcron/build-enviroment/sources/gcc-4_6-branch_gcc.gnu.org_.svn.gcc.branches_184847_.tar.g z

    Keine Ahnung woran das liegen könnte. Hast du vielleicht ausversehen die Datei umbenannt?


Seite 5 von 7 ErsteErste ... 34567 LetzteLetzte

Stichworte

Lesezeichen

Berechtigungen

  • Neue Themen erstellen: Nein
  • Themen beantworten: Nein
  • Anhänge hochladen: Nein
  • Beiträge bearbeiten: Nein
  •  
Diese Website benutzt Cookies
Wir benutzen Cookies um Sitzungsinformationen zu speichern. Dies erleichtert es uns z.B. Dich an Deine Login zu erinnern, Einstellungen der Webseite zu speichern, Inhalte und Werbung zu personalisieren, Social Media Funktionen anzubieten und unser Datenaufkommen zu analysieren. Wir teilen diese Informationen ebenfalls mit unseren Social Media-, Werbe- und Analysepartnern.
     
Alle Zeitangaben in WEZ +1. Es ist jetzt 16:49 Uhr.
Powered by vBulletin® Version 4.2.5 (Deutsch)
Copyright ©2017 Adduco Digital e.K. und vBulletin Solutions, Inc. Alle Rechte vorbehalten.
Resources saved on this page: MySQL 11,11%
Parts of this site powered by vBulletin Mods & Addons from DragonByte Technologies Ltd. (Details)
vBulletin Skin By: PurevB.com