Thanks Thanks:  100
Seite 3 von 34 ErsteErste 1234513 ... LetzteLetzte
Ergebnis 21 bis 30 von 331
  1. #21
    Mitglied
    Registriert seit
    02.10.2013
    Beiträge
    46
    Total Downloaded
    0
    Total Downloaded
    0
    ReceiverDankeAktivitäten
    Box 1:
    Golden Media Reloaded SPARK
     
     
    @Captain
    .
    spark7111@ubuntu:~$ sudo dpkg-reconfigure dash[sudo] password for spark7111:
    spark7111@ubuntu:~$ cd ~/openatv/build-enviroment
    spark7111@ubuntu:~/openatv/build-enviroment$ MACHINE=sparkreloaded DISTRO=openatv make image
    NOTE: Started PRServer with DBfile: /home/spark7111/openatv/build-enviroment/builds/openatv/spark/cache/prserv.sqlite3, IP: 127.0.0.1, PORT: 48704, PID: 10674
    ERROR: OE-core's config sanity checker detected a potential misconfiguration.
    Either fix the cause of this error or at your own risk disable the checker (see sanity.conf).
    Following is the list of potential problems / advisories:


    /bin/mknod has the setuid bit set. This interferes with pseudo and may cause other issues that break the build process.




    Summary: There was 1 ERROR message shown, returning a non-zero exit code.
    make: *** [image] Error 1
    spark7111@ubuntu:~/openatv/build-enviroment$
    Miniaturansichten angehängter Grafiken Miniaturansichten angehängter Grafiken Build own openATV SH4 Image-screenshot-2014-07-20-14-17-56.png  
    Golden Media Reloaded SPARK Sti7111

    •   Alt Advertising

       

  2. #22
    Avatar von Captain
    Registriert seit
    03.04.2013
    Beiträge
    9.404
    Themenstarter
    Total Downloaded
    162,35 MB
    Total Downloaded
    162,35 MB
    ReceiverDankeAktivitäten
    no idea sorry

  3. #23
    Mitglied
    Registriert seit
    02.10.2013
    Beiträge
    46
    Total Downloaded
    0
    Total Downloaded
    0
    ReceiverDankeAktivitäten
    Box 1:
    Golden Media Reloaded SPARK
     
     
    @Captain

    thx
    Golden Media Reloaded SPARK Sti7111

  4. #24
    Mitglied
    Registriert seit
    20.07.2014
    Beiträge
    32
    Total Downloaded
    0
    Total Downloaded
    0
    ReceiverDankeAktivitäten
    @pop1234:

    I think Your problem is here :

    Code:
    /bin/mknod has the setuid bit set. This interferes with pseudo and may cause other issues that break the build process.
    Try this to solve it :

    sudo chmod -s /bin/mknod

  5. Thanks pop1234 bedankten sich
  6. #25
    Mitglied
    Registriert seit
    02.10.2013
    Beiträge
    46
    Total Downloaded
    0
    Total Downloaded
    0
    ReceiverDankeAktivitäten
    Box 1:
    Golden Media Reloaded SPARK
     
     
    @DboxOldie

    thx
    Golden Media Reloaded SPARK Sti7111

  7. #26
    Mitglied
    Registriert seit
    02.10.2013
    Beiträge
    46
    Total Downloaded
    0
    Total Downloaded
    0
    ReceiverDankeAktivitäten
    Box 1:
    Golden Media Reloaded SPARK
     
     
    @spark

    you can help me

    this problem solved with you

    | /home/spark7111/openatv/build-enviroment/builds/openatv/spark/tmp/work-shared/gcc-4.8.2-r0/gcc-4.8.2/libgcc/config/sh/lib1funcs.S:2120:24: fatal error: asm/unistd.h: No such file or directory
    | #include <asm/unistd.h>
    | ^
    | compilation terminated.
    | make: *** [_ic_invalidate_syscall_s.o] Error 1
    | ERROR: oe_runmake failed
    | WARNING: /home/spark7111/openatv/build-enviroment/builds/openatv/spark/tmp/work/sh4-oe-linux/libgcc-initial/4.8.2-r0/temp/run.do_compile.24023:1 exit 1 from
    | exit 1
    | ERROR: Function failed: do_compile (log file is located at /home/spark7111/openatv/build-enviroment/builds/openatv/spark/tmp/work/sh4-oe-linux/libgcc-initial/4.8.2-r0/temp/log.do_compile.24023)
    ERROR: Task 349 (/home/spark7111/openatv/build-enviroment/openembedded-core/meta/recipes-devtools/gcc/libgcc-initial_4.8.bb, do_compile) failed with exit code '1'
    NOTE: Tasks Summary: Attempted 197 tasks of which 3 didn't need to be rerun and 1 failed.
    Waiting for 0 running tasks to finish:


    Summary: 1 task failed:
    /home/spark7111/openatv/build-enviroment/openembedded-core/meta/recipes-devtools/gcc/libgcc-initial_4.8.bb, do_compile
    Summary: There were 51 WARNING messages shown.
    Summary: There was 1 ERROR message shown, returning a non-zero exit code.
    make: *** [image] Error 1
    spark7111@ubuntu:~/openatv/build-enviroment$

    Golden Media Reloaded SPARK Sti7111

  8. #27
    Avatar von Lizard
    Registriert seit
    09.04.2013
    Beiträge
    129
    Total Downloaded
    4,17 MB
    Total Downloaded
    4,17 MB
    ReceiverDankeAktivitäten
    Box 1:
    Edision OS mega
     
     
    Box 2:
    Edision OS Mini / OS Mini +
     
     
    Box 3:
    Edision Optimuss OS1+/OS2+/OS3+
     
     
    Box 4:
    Edision Optimuss OS1/OS2
     
     
    Box 5:
    Edision Pingulux
     
     
    Aktuell gibt es folgende Fehlermeldung kurz vor Schluss beim versuch ein Image zu bauen.
    gebaut mit: MACHINE=arguspingulux DISTRO=openatv make image

    Code:
    ERROR: Unable to install packages. Command '/home/lizard/git-builds/spark/build-enviroment/builds/openatv/spark/tmp/sysroots/i686-linux/usr/bin/opkg-cl -f /home/lizard/git-builds/spark/build-enviroment/builds/openatv/spark/tmp/work/spark-oe-linux/openatv-image/4.1-r20140720190629/opkg.conf -o /home/lizard/git-builds/spark/build-enviroment/builds/openatv/spark/tmp/rootfs/spark --force_postinstall --prefer-arch-to-version   install opkg-collateral enigma2-plugin-settings-defaultsat openatv-base opkg' returned 255:
    Installing opkg-collateral (1.0-r2.0) on root.
    Downloading file:/home/lizard/git-builds/spark/build-enviroment/builds/openatv/spark/tmp/deploy/ipk/sh4/opkg-collateral_1.0-r2.0_sh4.ipk.
    Installing enigma2-plugin-settings-defaultsat (3.0+git0+b9ef62b082-r0.0) on root.
    Downloading file:/home/lizard/git-builds/spark/build-enviroment/builds/openatv/spark/tmp/deploy/ipk/all/enigma2-plugin-settings-defaultsat_3.0+git0+b9ef62b082-r0.0_all.ipk.
    Installing openatv-base (1.0-r15.0) on root.
    Downloading file:/home/lizard/git-builds/spark/build-enviroment/builds/openatv/spark/tmp/deploy/ipk/all/openatv-base_1.0-r15.0_all.ipk.
    package libtinfo5 suggests installing ncurses-terminfo
    packagegroup-base-alsa: unsatisfied recommendation for kernel-module-snd-pcm-oss
    packagegroup-base-alsa: unsatisfied recommendation for kernel-module-snd-mixer-oss
    packagegroup-base-wifi: unsatisfied recommendation for kernel-module-crypto_algapi
    packagegroup-base-wifi: unsatisfied recommendation for kernel-module-ieee80211-crypt
    packagegroup-base-wifi: unsatisfied recommendation for kernel-module-ieee80211-crypt-tkip
    packagegroup-base-wifi: unsatisfied recommendation for kernel-module-aes
    packagegroup-base-wifi: unsatisfied recommendation for kernel-module-ecb
    packagegroup-base-wifi: unsatisfied recommendation for kernel-module-michael-mic
    packagegroup-base-wifi: unsatisfied recommendation for kernel-module-ieee80211-crypt-wep
    packagegroup-base-wifi: unsatisfied recommendation for kernel-module-cryptomgr
    packagegroup-base-wifi: unsatisfied recommendation for kernel-module-ieee80211-crypt-ccmp
    packagegroup-base-wifi: unsatisfied recommendation for kernel-module-aes-generic
    packagegroup-base-wifi: unsatisfied recommendation for kernel-module-arc4
    packagegroup-base-ipv6: unsatisfied recommendation for kernel-module-ipv6
    packagegroup-base: unsatisfied recommendation for kernel-module-rtc-sysfs
    packagegroup-base: unsatisfied recommendation for kernel-module-rtc-proc
    packagegroup-base: unsatisfied recommendation for kernel-module-nls-utf8
    packagegroup-base: unsatisfied recommendation for kernel-module-rtc-dev
    packagegroup-base: unsatisfied recommendation for kernel-module-input
    packagegroup-base: unsatisfied recommendation for kernel-module-unix
    packagegroup-base: unsatisfied recommendation for kernel-module-uinput
    lirc: unsatisfied recommendation for kernel-module-uinput
    enigma2-plugin-drivers-network-usb-carl9170: unsatisfied recommendation for kernel-module-carl9170
    enigma2-plugin-drivers-network-usb-rtl8187: unsatisfied recommendation for kernel-module-rtl8187
    enigma2-plugin-drivers-network-usb-zd1211rw: unsatisfied recommendation for kernel-module-zd1211rw
    enigma2-plugin-drivers-network-usb-r8712u: unsatisfied recommendation for kernel-module-r8712u
    enigma2-plugin-drivers-network-usb-rt73: unsatisfied recommendation for kernel-module-rt73usb
    enigma2-plugin-drivers-network-usb-ath9k-htc: unsatisfied recommendation for kernel-module-ath9k-htc
    enigma2-plugin-drivers-network-usb-rt2800: unsatisfied recommendation for kernel-module-rt2800usb
    enigma2-plugin-drivers-network-usb-rt2500: unsatisfied recommendation for kernel-module-rt2500usb
    libfuse2: unsatisfied recommendation for kernel-module-fuse
    Installing opkg (1:0.2.2-r0.0) on root.
    Downloading file:/home/lizard/git-builds/spark/build-enviroment/builds/openatv/spark/tmp/deploy/ipk/sh4/opkg_0.2.2-r0.0_sh4.ipk.
    Installing opkg-config-base (1.0-r1.0) on root.
    Downloading file:/home/lizard/git-builds/spark/build-enviroment/builds/openatv/spark/tmp/deploy/ipk/arguspingulux/opkg-config-base_1.0-r1.0_arguspingulux.ipk.
    Installing update-alternatives-opkg (0.1.8+git0+d14458499a-r0.0) on root.
    Downloading file:/home/lizard/git-builds/spark/build-enviroment/builds/openatv/spark/tmp/deploy/ipk/sh4/update-alternatives-opkg_0.1.8+git0+d14458499a-r0.0_sh4.ipk.
    Installing libopkg1 (1:0.2.2-r0.0) on root.
    Downloading file:/home/lizard/git-builds/spark/build-enviroment/builds/openatv/spark/tmp/deploy/ipk/sh4/libopkg1_0.2.2-r0.0_sh4.ipk.
    Installing libc6 (2.19-r0.0) on root.
    Downloading file:/home/lizard/git-builds/spark/build-enviroment/builds/openatv/spark/tmp/deploy/ipk/sh4/libc6_2.19-r0.0_sh4.ipk.
    Installing run-postinsts (1.0-r9.0) on root.
    Downloading file:/home/lizard/git-builds/spark/build-enviroment/builds/openatv/spark/tmp/deploy/ipk/all/run-postinsts_1.0-r9.0_all.ipk.
     Removing any system startup links for run-postinsts ...
     Adding system startup for /home/lizard/git-builds/spark/build-enviroment/builds/openatv/spark/tmp/rootfs/spark/etc/init.d/run-postinsts.
    Configuring libc6.
    Configuring opkg-config-base.
    Configuring update-alternatives-opkg.
    Configuring libopkg1.
    Configuring run-postinsts.
    Configuring opkg.
    Configuring opkg-collateral.
    Configuring enigma2-plugin-settings-defaultsat.
    Collected errors:
     * satisfy_dependencies_for: Cannot satisfy the following dependencies for openatv-base:
     *     nmap * 
     * opkg_install_cmd: Cannot install package openatv-base.
    
    ERROR: Function failed: do_rootfs
    ERROR: Logfile of failure stored in: /home/lizard/git-builds/spark/build-enviroment/builds/openatv/spark/tmp/work/spark-oe-linux/openatv-image/4.1-r20140720190629/temp/log.do_rootfs.27363
    ERROR: Task 7 (/home/lizard/git-builds/spark/build-enviroment/meta-oe-alliance/meta-oe/recipes-distros/openatv/image/openatv-image.bb, do_rootfs) failed with exit code '1'
    NOTE: Tasks Summary: Attempted 9170 tasks of which 9153 didn't need to be rerun and 1 failed.
    No currently running tasks (9170 of 9173)
    
    Summary: 1 task failed:
      /home/lizard/git-builds/spark/build-enviroment/meta-oe-alliance/meta-oe/recipes-distros/openatv/image/openatv-image.bb, do_rootfs
    Summary: There were 50 WARNING messages shown.
    Summary: There were 2 ERROR messages shown, returning a non-zero exit code.
    make: *** [image] Fehler 1

  9. #28
    Avatar von Captain
    Registriert seit
    03.04.2013
    Beiträge
    9.404
    Themenstarter
    Total Downloaded
    162,35 MB
    Total Downloaded
    162,35 MB
    ReceiverDankeAktivitäten
    jo schon gesehen , das control file von plugin will es haben muss mir was ausdenken

  10. Thanks Lizard bedankten sich
  11. #29
    Mitglied
    Registriert seit
    02.10.2013
    Beiträge
    46
    Total Downloaded
    0
    Total Downloaded
    0
    ReceiverDankeAktivitäten
    Box 1:
    Golden Media Reloaded SPARK
     
     
    @Captain

    my problem ?
    Golden Media Reloaded SPARK Sti7111

  12. #30
    Avatar von mcron
    Registriert seit
    06.04.2013
    Ort
    FFM
    Beiträge
    143
    Total Downloaded
    14,43 MB
    Total Downloaded
    14,43 MB
    ReceiverDankeAktivitäten
    Box 1:
    Venton hd3
     
     
    Box 2:
    Vizyon 820hd
     
     
    Box 3:
    IPBOX99hd
     
     
    Box 4:
    IPBOX55hd
     
     
    Box 5:
    Dreambox 5620S
     
     
    kommen da noch andere sh4-boxen dazu oder sind das die einzigen ?


Seite 3 von 34 ErsteErste 1234513 ... LetzteLetzte

Stichworte

Lesezeichen

Berechtigungen

  • Neue Themen erstellen: Nein
  • Themen beantworten: Nein
  • Anhänge hochladen: Nein
  • Beiträge bearbeiten: Nein
  •  
Diese Website benutzt Cookies
Wir benutzen Cookies um Sitzungsinformationen zu speichern. Dies erleichtert es uns z.B. Dich an Deine Login zu erinnern, Einstellungen der Webseite zu speichern, Inhalte und Werbung zu personalisieren, Social Media Funktionen anzubieten und unser Datenaufkommen zu analysieren. Wir teilen diese Informationen ebenfalls mit unseren Social Media-, Werbe- und Analysepartnern.
     
Alle Zeitangaben in WEZ +1. Es ist jetzt 19:08 Uhr.
Powered by vBulletin® Version 4.2.3 (Deutsch)
Copyright ©2017 Adduco Digital e.K. und vBulletin Solutions, Inc. Alle Rechte vorbehalten.
Resources saved on this page: MySQL 10,53%
Parts of this site powered by vBulletin Mods & Addons from DragonByte Technologies Ltd. (Details)
vBulletin Skin By: PurevB.com