Thanks Thanks:  100
Seite 25 von 34 ErsteErste ... 152324252627 ... LetzteLetzte
Ergebnis 241 bis 250 von 331
  1. #241

    Registriert seit
    05.04.2013
    Beiträge
    7.209
    Total Downloaded
    289,07 MB
    Total Downloaded
    289,07 MB
    ReceiverDankeAktivitäten
    Zitat Zitat von Tommy82h Beitrag anzeigen
    hi,
    bekomme beim build diese fehlermeldung
    Code:
    MACHINE=vuuno DISTRO=openatv DISTRO_TYPE=release make image
    /bin/sh: 6: /home/thomas/openatv/build-enviroment/builds/openatv/release/vuuno/env.source: [[: not found
    -e check internet connection: \e[93mWaiting ...\e[0m/bin/sh: 12: /home/thomas/openatv/build-enviroment/builds/openatv/release/vuuno/env.source: [[: not found
    \e[31mOffline     \e[0m
    ERROR:  OE-core's config sanity checker detected a potential misconfiguration.
        Either fix the cause of this error or at your own risk disable the checker (see sanity.conf).
        Following is the list of potential problems / advisories:
    
        Failed to write into /tmp. Please verify your filesystem.
    
    Summary: There was 1 ERROR message shown, returning a non-zero exit code.
    Makefile:578: recipe for target 'image' failed
    make: *** [image] Error 1
    was ist das problem speicherplaty sollte genug da sein
    hast keine rechte in tmp zu schreiben? und keine inet verbindung?


    •   Alt Advertising

       

  2. #242
    Senior Mitglied
    Registriert seit
    19.07.2015
    Beiträge
    214
    Total Downloaded
    62,24 MB
    Total Downloaded
    62,24 MB
    ReceiverDankeAktivitäten
    Box 1:
    VU+ Ultimo OpenATV 5.3
     
     
    Box 2:
    VU+ Uno OpenATV 5.3
     
     
    Box 3:
    VU+ Uno OpenATV 5.3
     
     
    Hi, war wohl doch ein problem mit dem Speicherplatz.

    aber jetyt bekomme ich diese meldung, obwohl Opera hbbtv im source ordner ist

    Code:
    NOTE: Preparing RunQueue
    NOTE: Executing SetScene Tasks
    NOTE: Executing RunQueue Tasks
    ERROR: Function failed: do_fetch (log file is located at /home/thomas/openatv/build-enviroment/builds/openatv/release/vuuno/tmp/work/mips32el-oe-linux/vuplus-opera-browser-util/1.0-r42_20151001_1/temp/log.do_fetch.11274)
    ERROR: Logfile of failure stored in: /home/thomas/openatv/build-enviroment/builds/openatv/release/vuuno/tmp/work/mips32el-oe-linux/vuplus-opera-browser-util/1.0-r42_20151001_1/temp/log.do_fetch.11274
    Log data follows:
    | DEBUG: Executing shell function do_fetch
    | cp: cannot stat '/home/thomas/openatv/build-enviroment/sources/opera-hbbtv_20151001_1.tar.gz': No such file or directory
    | WARNING: exit code 1 from a shell command.
    | ERROR: Function failed: do_fetch (log file is located at /home/thomas/openatv/build-enviroment/builds/openatv/release/vuuno/tmp/work/mips32el-oe-linux/vuplus-opera-browser-util/1.0-r42_20151001_1/temp/log.do_fetch.11274)
    ERROR: Task 3027 (/home/thomas/openatv/build-enviroment/meta-oe-alliance/meta-brands/meta-vuplus/recipes-bsp/vuplus-opera-browser-util.bb, do_fetch) failed with exit code '1'
    NOTE: Tasks Summary: Attempted 6650 tasks of which 6643 didn't need to be rerun and 1 failed.
    Waiting for 0 running tasks to finish:
    
    Summary: 1 task failed:
      /home/thomas/openatv/build-enviroment/meta-oe-alliance/meta-brands/meta-vuplus/recipes-bsp/vuplus-opera-browser-util.bb, do_fetch
    Summary: There were 74 WARNING messages shown.
    Summary: There was 1 ERROR message shown, returning a non-zero exit code.
    Makefile:578: recipe for target 'image' failed
    make: *** [image] Error 1
    Edit, das problem hab ich gelst, hatte bersehen das es eine neue version gibt.

    jetyt bekomme ich einen neuen fehler

    ERROR: Task 5297 (/home/thomas/openatv/build-enviroment/meta-oe-alliance/meta-oe/recipes-oe-alliance/enigma2-plugins/enigma2-plugin-extensions-youtube.bb, do_compile) failed with exit code '1'
    NOTE: Tasks Summary: Attempted 8550 tasks of which 7806 didn't need to be rerun and 1 failed.
    Waiting for 0 running tasks to finish:

    Summary: 1 task failed:
    /home/thomas/openatv/build-enviroment/meta-oe-alliance/meta-oe/recipes-oe-alliance/enigma2-plugins/enigma2-plugin-extensions-youtube.bb, do_compile
    Summary: There were 21 WARNING messages shown.
    Summary: There was 1 ERROR message shown, returning a non-zero exit code.
    Makefile:578: recipe for target 'image' failed
    make: *** [image] Error 1
    wo gibts die fehlende youtube source-
    Geändert von Tommy82h (22.11.2015 um 12:21 Uhr)

  3. #243
    Senior Mitglied
    Registriert seit
    19.07.2015
    Beiträge
    214
    Total Downloaded
    62,24 MB
    Total Downloaded
    62,24 MB
    ReceiverDankeAktivitäten
    Box 1:
    VU+ Ultimo OpenATV 5.3
     
     
    Box 2:
    VU+ Uno OpenATV 5.3
     
     
    Box 3:
    VU+ Uno OpenATV 5.3
     
     
    Keiner eine idee?
    Danke

  4. #244
    Senior Mitglied
    Registriert seit
    19.07.2015
    Beiträge
    214
    Total Downloaded
    62,24 MB
    Total Downloaded
    62,24 MB
    ReceiverDankeAktivitäten
    Box 1:
    VU+ Ultimo OpenATV 5.3
     
     
    Box 2:
    VU+ Uno OpenATV 5.3
     
     
    Box 3:
    VU+ Uno OpenATV 5.3
     
     
    Also ich hab den Build jetzt mehrfach angestossen, aber immer kommt der gleiche Fehler.
    Wie kann ich das lösen?
    Danke

    Code:
    release/vuuno/tmp/work/mips32el-oe-linux/enigma2-plugin-extensions-youtube/gitAUTOINC+cf482ece3c-r0/temp/run.do_compile.20574: pushd: not found
    | WARNING: exit code 127 from a shell command.
    | ERROR: Function failed: do_compile (log file is located at /home/thomas/openatv/build-enviroment/builds/openatv/release/vuuno/tmp/work/mips32el-oe-linux/enigma2-plugin-extensions-youtube/gitAUTOINC+cf482ece3c-r0/temp/log.do_compile.20574)
    ERROR: Task 5297 (/home/thomas/openatv/build-enviroment/meta-oe-alliance/meta-oe/recipes-oe-alliance/enigma2-plugins/enigma2-plugin-extensions-youtube.bb, do_compile) failed with exit code '1'
    NOTE: Tasks Summary: Attempted 8539 tasks of which 8207 didn't need to be rerun and 1 failed.
    Waiting for 0 running tasks to finish:
    
    Summary: 1 task failed:
      /home/thomas/openatv/build-enviroment/meta-oe-alliance/meta-oe/recipes-oe-alliance/enigma2-plugins/enigma2-plugin-extensions-youtube.bb, do_compile
    Summary: There were 74 WARNING messages shown.
    Summary: There was 1 ERROR message shown, returning a non-zero exit code.
    Makefile:578: recipe for target 'image' failed
    make: *** [image] Error 1
    Geändert von Tommy82h (01.12.2015 um 21:38 Uhr)

  5. #245
    Avatar von betacentauri
    Registriert seit
    15.06.2013
    Beiträge
    1.244
    Total Downloaded
    1,32 MB
    Total Downloaded
    1,32 MB
    ReceiverDankeAktivitäten
    Box 1:
    ET-9200
     
     
    Box 2:
    ET-10000
     
     
    Box 3:
    ET-8500
     
     
    Box 4:
    ET-8000
     
     
    Box 5:
    Gigablue Quad+
     
     
    Lösch zur Not das Bitbake File. Also
    rm /home/thomas/openatv/build-enviroment/meta-oe-alliance/meta-oe/recipes-oe-alliance/enigma2-plugins/enigma2-plugin-extensions-youtube.bb
    ( oder verschieb es nach /home/thomas )
    ET-10000, ET-9200, ET-8000, Gigablue Quad+

  6. #246
    Senior Mitglied
    Registriert seit
    19.07.2015
    Beiträge
    214
    Total Downloaded
    62,24 MB
    Total Downloaded
    62,24 MB
    ReceiverDankeAktivitäten
    Box 1:
    VU+ Ultimo OpenATV 5.3
     
     
    Box 2:
    VU+ Uno OpenATV 5.3
     
     
    Box 3:
    VU+ Uno OpenATV 5.3
     
     
    Hi,
    so hat es jetzt problemlos geklappt.
    Danke für die Hilfe.

    Klappt der Imagebau auch unter openSuse?
    Würde das gerne da machen um nicht immer meine VM mit Ubuntu starten zu müssen.

    Ich hab es unter OpenSuse Tumbleweed mal versucht, indem ich die unter Ubuntu benötigten Pakete(sofern es sie für OpenSuse gibt) mal installiert habe

    Dabei bekomme ich dann diese Meldung das die Pakete nicht gefunden wurden:
    Code:
    'default-jre' wurde in den Paketnamen nicht gefunden. Fähigkeiten werden durchsucht.
    Keine Anbieter von 'default-jre' gefunden.
    'default-jre-headless' wurde in den Paketnamen nicht gefunden. Fähigkeiten werden durchsucht.
    Keine Anbieter von 'default-jre-headless' gefunden.
    'g++' wurde in den Paketnamen nicht gefunden. Fähigkeiten werden durchsucht.
    Keine Anbieter von 'g++' gefunden.                                                                                                                                                                                                          
    'java-common' wurde in den Paketnamen nicht gefunden. Fähigkeiten werden durchsucht.                                                                                                                                                        
    Keine Anbieter von 'java-common' gefunden.                                                                                                                                                                                                  
    'libc6-dev' wurde in den Paketnamen nicht gefunden. Fähigkeiten werden durchsucht.                                                                                                                                                          
    Keine Anbieter von 'libc6-dev' gefunden.                                                                                                                                                                                                    
    'libglib2.0-dev' wurde in den Paketnamen nicht gefunden. Fähigkeiten werden durchsucht.                                                                                                                                                     
    Keine Anbieter von 'libglib2.0-dev' gefunden.                                                                                                                                                                                               
    'libperl4-corelibs-perl' wurde in den Paketnamen nicht gefunden. Fähigkeiten werden durchsucht.                                                                                                                                             
    Keine Anbieter von 'libperl4-corelibs-perl' gefunden.                                                                                                                                                                                       
    'libproc-processtable-perl' wurde in den Paketnamen nicht gefunden. Fähigkeiten werden durchsucht.                                                                                                                                          
    Keine Anbieter von 'libproc-processtable-perl' gefunden.                                                                                                                                                                                    
    'libserf-dev' wurde in den Paketnamen nicht gefunden. Fähigkeiten werden durchsucht.                                                                                                                                                        
    Keine Anbieter von 'libserf-dev' gefunden.                                                                                                                                                                                                  
    'libxml2-utils' wurde in den Paketnamen nicht gefunden. Fähigkeiten werden durchsucht.                                                                                                                                                      
    Keine Anbieter von 'libxml2-utils' gefunden.                                                                                                                                                                                                
    'ncurses-bin' wurde in den Paketnamen nicht gefunden. Fähigkeiten werden durchsucht.                                                                                                                                                        
    Keine Anbieter von 'ncurses-bin' gefunden.                                                                                                                                                                                                  
    'ncurses-dev' wurde in den Paketnamen nicht gefunden. Fähigkeiten werden durchsucht.                                                                                                                                                        
    Keine Anbieter von 'ncurses-dev' gefunden.                                                                                                                                                                                                  
    'zlib1g-dev' wurde in den Paketnamen nicht gefunden. Fähigkeiten werden durchsucht.                                                                                                                                                         
    Keine Anbieter von 'zlib1g-dev' gefunden.                                                                                                                                                                                                   
    Paketabhängigkeiten auflösen ...                                                   
    Hab dann im glauben das das die Fehlenden sind, diese hier installiert:
    Code:
    'gcc-c++' -------- (Ist das was g++) wäre denke ich.
    glib2-devel ---- libglib2.0-dev
    zlib-devel ---- 'zlib1g-dev'
    ncurses-devel --- 'ncurses-dev'
    libserf-devel ---- 'libserf-dev'
    glibc-devel ---- 'libc6-dev'
    libxml2-tools ---- 'libxml2-utils'
    perl-Proc-ProcessTable ---- 'libproc-processtable-perl'
    ncurses-utils ----- 'ncurses-bin'
    java-1_8_0-openjdk-headless ----- 'default-jre-headless' 
    
    beim build versuch bleibt es dann mit dieser Meldung hängen:
    Code:
     cd build-enviroment
    thomas@LinuxBuero:~/openatv/build-enviroment> MACHINE=vuuno DISTRO=openatv DISTRO_TYPE=release make image
    check internet connection: Online      
    NOTE: Your conf/bblayers.conf has been automatically updated.
    WARNING: Unable to get checksum for linux-xcore SRC_URI entry defconfig: file could not be found
    WARNING: Unable to get checksum for linux-xcore SRC_URI entry defconfig: file could not be found
    WARNING: Unable to get checksum for linux-xcore SRC_URI entry defconfig: file could not be found
    WARNING: Unable to get checksum for linux-etxx00 SRC_URI entry defconfig: file could not be found
    WARNING: Unable to get checksum for linux-etxx00 SRC_URI entry defconfig: file could not be found
    WARNING: Unable to get checksum for linux-etxx00 SRC_URI entry defconfig: file could not be found
    WARNING: Unable to get checksum for linux-etxx00 SRC_URI entry defconfig: file could not be found
    WARNING: Unable to get checksum for linux-etxx00 SRC_URI entry defconfig: file could not be found
    WARNING: Unable to get checksum for linux-etxx00 SRC_URI entry add-dmx-source-timecode.patch: file could not be found
    WARNING: Unable to get checksum for linux-etxx00 SRC_URI entry af9015-output-full-range-SNR.patch: file could not be found
    WARNING: Unable to get checksum for linux-etxx00 SRC_URI entry af9033-output-full-range-SNR.patch: file could not be found
    WARNING: Unable to get checksum for linux-etxx00 SRC_URI entry as102-adjust-signal-strength-report.patch: file could not be found
    WARNING: Unable to get checksum for linux-etxx00 SRC_URI entry as102-scale-MER-to-full-range.patch: file could not be found
    WARNING: Unable to get checksum for linux-etxx00 SRC_URI entry cxd2820r-output-full-range-SNR.patch: file could not be found
    WARNING: Unable to get checksum for linux-etxx00 SRC_URI entry dvb-usb-dib0700-disable-sleep.patch: file could not be found
    WARNING: Unable to get checksum for linux-etxx00 SRC_URI entry dvb_usb_disable_rc_polling.patch: file could not be found
    WARNING: Unable to get checksum for linux-etxx00 SRC_URI entry fix-proc-cputype.patch: file could not be found
    WARNING: Unable to get checksum for linux-etxx00 SRC_URI entry iosched-slice_idle-1.patch: file could not be found
    WARNING: Unable to get checksum for linux-etxx00 SRC_URI entry it913x-switch-off-PID-filter-by-default.patch: file could not be found
    WARNING: Unable to get checksum for linux-etxx00 SRC_URI entry tda18271-advertise-supported-delsys.patch: file could not be found
    WARNING: Unable to get checksum for linux-etxx00 SRC_URI entry mxl5007t-add-no_probe-and-no_reset-parameters.patch: file could not be found
    WARNING: Unable to get checksum for linux-xp SRC_URI entry defconfig: file could not be found
    WARNING: Unable to get checksum for linux-vuplus SRC_URI entry defconfig: file could not be found
    WARNING: Unable to get checksum for linux-vuplus SRC_URI entry defconfig: file could not be found
    WARNING: Unable to get checksum for linux-ultramini SRC_URI entry defconfig: file could not be found
    WARNING: Unable to get checksum for linux-tripledot SRC_URI entry defconfig: file could not be found
    WARNING: Unable to get checksum for linux-skylake SRC_URI entry defconfig: file could not be found
    WARNING: Unable to get checksum for linux-odin SRC_URI entry defconfig: file could not be found
    WARNING: Unable to get checksum for linux-odin SRC_URI entry vuuno-board.patch: file could not be found
    WARNING: Unable to get checksum for linux-odin SRC_URI entry defconfig: file could not be found
    WARNING: Unable to get checksum for odin-backup SRC_URI entry odin-backup.sh: file could not be found
    WARNING: Unable to get checksum for linux-broadmedia SRC_URI entry defconfig: file could not be found                                                      
    WARNING: Unable to get checksum for linux-ixuss SRC_URI entry defconfig: file could not be found                                                           
    WARNING: Unable to get checksum for linux-ini-hdp SRC_URI entry defconfig: file could not be found                                                         
    WARNING: Unable to get checksum for linux-ini-hde2 SRC_URI entry defconfig: file could not be found                                                        
    WARNING: Unable to get checksum for linux-ini-hde SRC_URI entry defconfig: file could not be found                                                         
    WARNING: Unable to get checksum for linux-ini-hdx SRC_URI entry defconfig: file could not be found                                                         
    WARNING: Unable to get checksum for linux-gigablue SRC_URI entry defconfig: file could not be found                                                        
    WARNING: Unable to get checksum for linux-gigablue SRC_URI entry defconfig: file could not be found                                                        
    WARNING: Unable to get checksum for linux-gigablue SRC_URI entry defconfig: file could not be found                                                        
    WARNING: Unable to get checksum for fulan-dvb-modules SRC_URI entry modules.conf: file could not be found                                                  
    WARNING: Unable to get checksum for fulan-dvb-modules SRC_URI entry modules-conf.conf: file could not be found                                             
    WARNING: Unable to get checksum for linux-fulan SRC_URI entry defconfig: file could not be found                                                           
    WARNING: Unable to get checksum for linux-formuler SRC_URI entry defconfig: file could not be found                                                        
    WARNING: Unable to get checksum for linux-entwopia SRC_URI entry defconfig: file could not be found                                                                                                                                         
    WARNING: Unable to get checksum for linux-ebox SRC_URI entry defconfig: file could not be found                                                                                                                                             
    WARNING: Unable to get checksum for dreambox-enigma2-config SRC_URI entry skin_box.xml: file could not be found                                                                                                                             
    WARNING: Unable to get checksum for dreambox-dvb-modules-dm800sev2 SRC_URI entry modules: file could not be found                                                                                                                           
    WARNING: Unable to get checksum for dreambox-dvb-modules-dm820 SRC_URI entry modules: file could not be found                                                                                                                               
    WARNING: Unable to get checksum for dreambox-dvb-modules-dm800se SRC_URI entry modules: file could not be found                                                                                                                             
    WARNING: Unable to get checksum for dreambox-dvb-modules-dm8000 SRC_URI entry modules: file could not be found                                                                                                                              
    WARNING: Unable to get checksum for linux-dreambox SRC_URI entry defconfig: file could not be found                                                                                                                                         
    WARNING: Unable to get checksum for dreambox-dvb-modules-dm7080 SRC_URI entry modules: file could not be found                                                                                                                              
    WARNING: Unable to get checksum for dreambox-dvb-modules-dm500hd SRC_URI entry modules: file could not be found                                                                                                                             
    WARNING: Unable to get checksum for dreambox-dvb-modules-dm7020hd SRC_URI entry modules: file could not be found                                                                                                                            
    WARNING: Unable to get checksum for dreambox-dvb-modules-dm500hdv2 SRC_URI entry modules: file could not be found                                                                                                                           
    WARNING: Unable to get checksum for linux-dags SRC_URI entry defconfig: file could not be found                                                                                                                                             
    WARNING: Unable to get checksum for linux-cube SRC_URI entry defconfig: file could not be found                                                                                                                                             
    WARNING: Unable to get checksum for linux-ceryon SRC_URI entry defconfig: file could not be found                                                                                                                                           
    WARNING: Unable to get checksum for linux-blackbox SRC_URI entry defconfig: file could not be found                                                                                                                                         
    WARNING: Unable to get checksum for linux-azbox SRC_URI entry defconfig: file could not be found                                                                                                                                            
    WARNING: Unable to get checksum for linux-azbox SRC_URI entry defconfig: file could not be found                                                                                                                                            
    WARNING: Unable to get checksum for linux-airdigital SRC_URI entry defconfig: file could not be found                                                                                                                                       
    WARNING: Unable to get checksum for graphlcd-base SRC_URI entry graphlcd.conf: file could not be found                                                                                                                                      
    WARNING: Unable to get checksum for graphlcd-base SRC_URI entry glcd-mipsel.patch: file could not be found                                                                                                                                  
    WARNING: Unable to get checksum for graphlcd-base SRC_URI entry glcd-vuduo2.patch: file could not be found                                                                                                                                  
    WARNING: Variable key RPROVIDES_${PN} (hotplug) replaces original key RPROVIDES_udev ( udev-compat-wrapper).                                                                                                                                
    WARNING: qt-mobility-embedded: invalid PACKAGECONFIG: bluez5                                                                                                                                                                                
    WARNING: qt-mobility-x11: invalid PACKAGECONFIG: bluez5                                                                                                                                                                                     
    WARNING: gpsd: invalid PACKAGECONFIG: bluez5                                                                                                                                                                                                
    WARNING: Unable to get checksum for vsftpd SRC_URI entry vsftpd.chroot_list: file could not be found                                                                                                                                        
    WARNING: Unable to get checksum for vsftpd SRC_URI entry init.vsftpd: file could not be found                                                                                                                                               
    WARNING: Unable to get checksum for vsftpd SRC_URI entry ftp.service: file could not be found                                                                                                                                               
    NOTE: glibc can't be built with -Os, -Os -Wno-error will be used instead.                                                                                                                                                                   
    NOTE: glibc can't be built with -Os, -Os -Wno-error will be used instead.   
    Einer eine idee was da noch nicht passt? Oder kann ich mir den versuch gleich sparen?

  7. #247
    Anfänger
    Registriert seit
    05.01.2014
    Beiträge
    12
    Total Downloaded
    912,46 MB
    Total Downloaded
    912,46 MB
    ReceiverDankeAktivitäten
    Is there an issue with git hub ?? Every build attempt keeps failing on a different "failed to fetch error" ???
    restart the build and the failure is a different recipe each time.....

    Thanks

  8. #248
    Mitglied
    Registriert seit
    17.04.2013
    Beiträge
    73
    Total Downloaded
    7,37 MB
    Total Downloaded
    7,37 MB
    ReceiverDankeAktivitäten
    Box 1:
    Duo2
     
     
    Ich baue mir gerade das 1. Mal für die Duo2 ein OpenATV Image, nach ca. 8h Laufzeit, kurz vorm Schluß
    bekomme ich folgende Error Meldung:


    Code:
    ERROR: Function failed: do_compile (log file is located at /home/akki/openatv/build-enviroment/builds/openatv/release/vuduo2/tmp/work/vuduo2-oe-linux/usb-dvb-dvbsky/141106-r10/temp/log.do_compile.28285)
    ERROR: Logfile of failure stored in: /home/akki/openatv/build-enviroment/builds/openatv/release/vuduo2/tmp/work/vuduo2-oe-linux/usb-dvb-dvbsky/141106-r10/temp/log.do_compile.28285
    Log data follows:
    | DEBUG: Executing shell function do_compile
    | NOTE: make -j6 KDIR=/home/akki/openatv/build-enviroment/builds/openatv/release/vuduo2/tmp/work-shared/vuduo2/kernel-source SRCDIR=/home/akki/openatv/build-enviroment/builds/openatv/release/vuduo2/tmp/work-shared/vuduo2/kernel-source OUTDIR=/home/akki/openatv/build-enviroment/builds/openatv/release/vuduo2/tmp/work-shared/vuduo2/kernel-build-artifacts KERNEL_SRC=/home/akki/openatv/build-enviroment/builds/openatv/release/vuduo2/tmp/work-shared/vuduo2/kernel-source KERNEL_PATH=/home/akki/openatv/build-enviroment/builds/openatv/release/vuduo2/tmp/work-shared/vuduo2/kernel-build-artifacts KDIR=/home/akki/openatv/build-enviroment/builds/openatv/release/vuduo2/tmp/work-shared/vuduo2/kernel-source DIR=/home/akki/openatv/build-enviroment/builds/openatv/release/vuduo2/tmp/work-shared/vuduo2/kernel-source KERNEL_VERSION=3.13.5 CC=mipsel-oe-linux-gcc  LD=mipsel-oe-linux-ld.bfd  AR=mipsel-oe-linux-ar  O=/home/akki/openatv/build-enviroment/builds/openatv/release/vuduo2/tmp/work-shared/vuduo2/kernel-build-artifacts
    | make -C /home/akki/openatv/build-enviroment/builds/openatv/release/vuduo2/tmp/work/vuduo2-oe-linux/usb-dvb-dvbsky/141106-r10/media_build-bst-14/v4l
    | make[1]: Entering directory `/home/akki/openatv/build-enviroment/builds/openatv/release/vuduo2/tmp/work/vuduo2-oe-linux/usb-dvb-dvbsky/141106-r10/media_build-bst-14/v4l'
    | creating symbolic links...
    | make -C firmware prep
    | make[2]: Entering directory `/home/akki/openatv/build-enviroment/builds/openatv/release/vuduo2/tmp/work/vuduo2-oe-linux/usb-dvb-dvbsky/141106-r10/media_build-bst-14/v4l/firmware'
    | make[2]: Leaving directory `/home/akki/openatv/build-enviroment/builds/openatv/release/vuduo2/tmp/work/vuduo2-oe-linux/usb-dvb-dvbsky/141106-r10/media_build-bst-14/v4l/firmware'
    | make -C firmware
    | make[2]: Entering directory `/home/akki/openatv/build-enviroment/builds/openatv/release/vuduo2/tmp/work/vuduo2-oe-linux/usb-dvb-dvbsky/141106-r10/media_build-bst-14/v4l/firmware'
    | make[2]: Nothing to be done for `default'.
    | make[2]: Leaving directory `/home/akki/openatv/build-enviroment/builds/openatv/release/vuduo2/tmp/work/vuduo2-oe-linux/usb-dvb-dvbsky/141106-r10/media_build-bst-14/v4l/firmware'
    | Kernel build directory is /home/akki/openatv/build-enviroment/builds/openatv/release/vuduo2/tmp/work-shared/vuduo2/kernel-build-artifacts
    | make -C /home/akki/openatv/build-enviroment/builds/openatv/release/vuduo2/tmp/work-shared/vuduo2/kernel-build-artifacts SUBDIRS=/home/akki/openatv/build-enviroment/builds/openatv/release/vuduo2/tmp/work/vuduo2-oe-linux/usb-dvb-dvbsky/141106-r10/media_build-bst-14/v4l  modules
    | make[2]: Entering directory `/home/akki/openatv/build-enviroment/builds/openatv/release/vuduo2/tmp/work-shared/vuduo2/kernel-build-artifacts'
    |   Building modules, stage 2.
    |   MODPOST 5 modules
    | make[2]: Leaving directory `/home/akki/openatv/build-enviroment/builds/openatv/release/vuduo2/tmp/work-shared/vuduo2/kernel-build-artifacts'
    | ./scripts/rmmod.pl check
    | Can't locate Proc/ProcessTable.pm in @INC (@INC contains: /etc/perl /usr/local/lib/perl/5.14.2 /usr/local/share/perl/5.14.2 /usr/lib/perl5 /usr/share/perl5 /usr/lib/perl/5.14 /usr/share/perl/5.14 /usr/local/lib/site_perl .) at ./scripts/rmmod.pl line 4.
    | BEGIN failed--compilation aborted at ./scripts/rmmod.pl line 4.
    | make[1]: *** [default] Error 2
    | make[1]: Leaving directory `/home/akki/openatv/build-enviroment/builds/openatv/release/vuduo2/tmp/work/vuduo2-oe-linux/usb-dvb-dvbsky/141106-r10/media_build-bst-14/v4l'
    | make: *** [all] Error 2
    | ERROR: oe_runmake failed
    | WARNING: /home/akki/openatv/build-enviroment/builds/openatv/release/vuduo2/tmp/work/vuduo2-oe-linux/usb-dvb-dvbsky/141106-r10/temp/run.do_compile.28285:1 exit 1 from
    |   exit 1
    | ERROR: Function failed: do_compile (log file is located at /home/akki/openatv/build-enviroment/builds/openatv/release/vuduo2/tmp/work/vuduo2-oe-linux/usb-dvb-dvbsky/141106-r10/temp/log.do_compile.28285)
    ERROR: Task 8628 (/home/akki/openatv/build-enviroment/meta-oe-alliance/meta-oe/recipes-multimedia/media-tree-dvb-sky/usb-dvb-dvbsky_141106.bb, do_compile) failed with exit code '1'
    Hat jemamd nen Tipp was den Fehler verursacht bzw. was ich machen kann, so wie es aussieht muss es am Modul usb-dvb-dvbsky liegen.


    Danke schonmal

    Akki

  9. #249
    Mitglied
    Registriert seit
    17.04.2013
    Beiträge
    73
    Total Downloaded
    7,37 MB
    Total Downloaded
    7,37 MB
    ReceiverDankeAktivitäten
    Box 1:
    Duo2
     
     
    Schade das mir keiner von den Profi Imagebauern mir sagen kann was ich tun kann bei der obigen Fehlermeldung, hab schon 2 mal neu angefangen, jedesmal
    bleibt er beim usb-dvb-dvbsky stehen.

    Naja egal dann soll es halt nicht sein, sich mal sein Image selber zu bauen.

  10. #250
    Anfänger
    Registriert seit
    29.05.2015
    Beiträge
    1
    Total Downloaded
    0
    Total Downloaded
    0
    ReceiverDankeAktivitäten
    Hi,

    I am using Ubuntu 14.04 32 bit, it is freash, wihout history, just installed
    Building image for arm works properly, but it fails with the following error, when I'm trying to build image for sparktriplex. Advice from post #4 doesn't help.
    Does anyone know where the issue exists and how to resolve it?
    | /openATVtoolschain/build-enviroment/builds/openatv/release/spark7162/tmp/work-shared/gcc-4.8.4-r0/gcc-4.8.4/libgcc/config/sh/lib1funcs.S:2120:24: fatal error: asm/unistd.h: No such file or directory
    | #include <asm/unistd.h>
    | ^
    | compilation terminated.
    | make: *** [_ic_invalidate_syscall_s.o] Error 1
    | ERROR: oe_runmake failed
    | WARNING: exit code 1 from a shell command.


Seite 25 von 34 ErsteErste ... 152324252627 ... LetzteLetzte

Stichworte

Lesezeichen

Berechtigungen

  • Neue Themen erstellen: Nein
  • Themen beantworten: Nein
  • Anhänge hochladen: Nein
  • Beiträge bearbeiten: Nein
  •  
Diese Website benutzt Cookies
Wir benutzen Cookies um Sitzungsinformationen zu speichern. Dies erleichtert es uns z.B. Dich an Deine Login zu erinnern, Einstellungen der Webseite zu speichern, Inhalte und Werbung zu personalisieren, Social Media Funktionen anzubieten und unser Datenaufkommen zu analysieren. Wir teilen diese Informationen ebenfalls mit unseren Social Media-, Werbe- und Analysepartnern.
     
Alle Zeitangaben in WEZ +1. Es ist jetzt 08:27 Uhr.
Powered by vBulletin® Version 4.2.3 (Deutsch)
Copyright ©2017 Adduco Digital e.K. und vBulletin Solutions, Inc. Alle Rechte vorbehalten.
Resources saved on this page: MySQL 11,76%
Parts of this site powered by vBulletin Mods & Addons from DragonByte Technologies Ltd. (Details)
vBulletin Skin By: PurevB.com