Thanks Thanks:  100
Seite 22 von 34 ErsteErste ... 12202122232432 ... LetzteLetzte
Ergebnis 211 bis 220 von 331
  1. #211

    Registriert seit
    05.04.2013
    Beiträge
    7.200
    Total Downloaded
    289,07 MB
    Total Downloaded
    289,07 MB
    ReceiverDankeAktivitäten
    deine hdd zu klein?
    [Errno 12] Cannot allocate memory


    •   Alt Advertising

       

  2. #212
    Senior Mitglied
    Registriert seit
    19.07.2015
    Beiträge
    214
    Total Downloaded
    62,24 MB
    Total Downloaded
    62,24 MB
    ReceiverDankeAktivitäten
    Box 1:
    VU+ Ultimo OpenATV 5.3
     
     
    Box 2:
    VU+ Uno OpenATV 5.3
     
     
    Box 3:
    VU+ Uno OpenATV 5.3
     
     
    memory sollte doch RAM sein oder? sonst käme doch not enough space oder!?
    Hab der VM mal grade mehr Ram zugewiesen, mal sehen was jetzt passiert. Woher kommen die Warnings, bzw. was kann ich dagegen tun?

    Danke

  3. #213

    Registriert seit
    05.04.2013
    Beiträge
    7.200
    Total Downloaded
    289,07 MB
    Total Downloaded
    289,07 MB
    ReceiverDankeAktivitäten
    die checksum warnings? die sind normal.


  4. #214
    Mitglied
    Registriert seit
    02.10.2013
    Beiträge
    46
    Total Downloaded
    0
    Total Downloaded
    0
    ReceiverDankeAktivitäten
    Box 1:
    Golden Media Reloaded SPARK
     
     
    hi

    error

    MACHINE=sparkreloaded DISTRO=openatv DISTRO_TYPE=release make image

    | sh4-oe-linux-gcc -ml -m4 --sysroot=/home/pop/Desktop/spark/build-enviroment/builds/openatv/release/spark/tmp/sysroots/spark -Os -pipe -g -feliminate-unused-debug-types -O2 -Os -pipe -g -feliminate-unused-debug-types -g -Os -DIN_GCC -DCROSS_DIRECTORY_STRUCTURE -W -Wall -Wno-narrowing -Wwrite-strings -Wcast-qual -Wstrict-prototypes -Wmissing-prototypes -Wold-style-definition -isystem ./include -fpic -DNO_FPSCR_VALUES -w -Wno-sync-nand -g -DIN_LIBGCC2 -fbuilding-libgcc -fno-stack-protector -Dinhibit_libc -fpic -DNO_FPSCR_VALUES -w -Wno-sync-nand -I. -I. -I/home/pop/Desktop/spark/build-enviroment/builds/openatv/release/spark/tmp/work/sh4-oe-linux/libgcc-initial/4.8.4-r0/gcc-4.8.4/build.sh4-oe-linux.sh4-oe-linux/sh4-oe-linux/libgcc/../.././gcc -I/home/pop/Desktop/spark/build-enviroment/builds/openatv/release/spark/tmp/work-shared/gcc-4.8.4-r0/gcc-4.8.4/libgcc -I/home/pop/Desktop/spark/build-enviroment/builds/openatv/release/spark/tmp/work-shared/gcc-4.8.4-r0/gcc-4.8.4/libgcc/. -I/home/pop/Desktop/spark/build-enviroment/builds/openatv/release/spark/tmp/work-shared/gcc-4.8.4-r0/gcc-4.8.4/libgcc/../gcc -I/home/pop/Desktop/spark/build-enviroment/builds/openatv/release/spark/tmp/work-shared/gcc-4.8.4-r0/gcc-4.8.4/libgcc/../include -DHAVE_CC_TLS -o _ic_invalidate_syscall_s.o -MT _ic_invalidate_syscall_s.o -MD -MP -MF _ic_invalidate_syscall_s.dep -DSHARED -DL_ic_invalidate_syscall -xassembler-with-cpp -c /home/pop/Desktop/spark/build-enviroment/builds/openatv/release/spark/tmp/work-shared/gcc-4.8.4-r0/gcc-4.8.4/libgcc/config/sh/lib1funcs.S
    | /home/pop/Desktop/spark/build-enviroment/builds/openatv/release/spark/tmp/work-shared/gcc-4.8.4-r0/gcc-4.8.4/libgcc/config/sh/lib1funcs.S:2120:24: fatal error: asm/unistd.h: No such file or directory
    | #include <asm/unistd.h>
    | ^
    | compilation terminated.
    | make: *** [_ic_invalidate_syscall_s.o] Error 1
    | ERROR: oe_runmake failed
    | WARNING: /home/pop/Desktop/spark/build-enviroment/builds/openatv/release/spark/tmp/work/sh4-oe-linux/libgcc-initial/4.8.4-r0/temp/run.do_compile.8729:1 exit 1 from
    | exit 1
    | ERROR: Function failed: do_compile (log file is located at /home/pop/Desktop/spark/build-enviroment/builds/openatv/release/spark/tmp/work/sh4-oe-linux/libgcc-initial/4.8.4-r0/temp/log.do_compile.8729)
    ERROR: Task 480 (/home/pop/Desktop/spark/build-enviroment/openembedded-core/meta/recipes-devtools/gcc/libgcc-initial_4.8.bb, do_compile) failed with exit code '1'
    NOTE: Tasks Summary: Attempted 224 tasks of which 0 didn't need to be rerun and 1 failed.
    No currently running tasks (224 of 10385)

    Summary: 1 task failed:
    /home/pop/Desktop/spark/build-enviroment/openembedded-core/meta/recipes-devtools/gcc/libgcc-initial_4.8.bb, do_compile
    Summary: There were 72 WARNING messages shown.
    Summary: There was 1 ERROR message shown, returning a non-zero exit code.
    make: *** [image] Error 1
    pop@ubuntu:~/Desktop/spark/build-enviroment$
    Geändert von pop1234 (10.10.2015 um 22:58 Uhr)
    Golden Media Reloaded SPARK Sti7111

  5. #215
    Mitglied
    Registriert seit
    02.10.2013
    Beiträge
    46
    Total Downloaded
    0
    Total Downloaded
    0
    ReceiverDankeAktivitäten
    Box 1:
    Golden Media Reloaded SPARK
     
     
    how i can resolve this error ?
    Golden Media Reloaded SPARK Sti7111

  6. #216
    Senior Mitglied
    Registriert seit
    19.07.2015
    Beiträge
    214
    Total Downloaded
    62,24 MB
    Total Downloaded
    62,24 MB
    ReceiverDankeAktivitäten
    Box 1:
    VU+ Ultimo OpenATV 5.3
     
     
    Box 2:
    VU+ Uno OpenATV 5.3
     
     
    Box 3:
    VU+ Uno OpenATV 5.3
     
     
    Wieviel Speicherplatz werden benötigt für das erstellen eines Images? Meine VM mit 25 GB reichen anscheint nicht!?
    Und wie lange dauert der Vorgang, dachte erst das mein Laptop zu schwach sei, aber selbst auf meinem i 7 6700 mit 16 GB Ram dauert es noch sehr lange (2-3 Stunden) bis dann die Meldung kommt Platte voll

  7. #217

    Registriert seit
    05.04.2013
    Beiträge
    7.200
    Total Downloaded
    289,07 MB
    Total Downloaded
    289,07 MB
    ReceiverDankeAktivitäten
    das kommt drauf an, wieviel speicher, kerne usw der vm zuteilst. ideal ist ein linux standalone rechner.

    aber beim ersten build vergeht einige zeit.

    wieviel du genau brauchst, weiß ich auch nicht. der source ordner braucht schon 6-7gb.


  8. #218
    Senior Mitglied
    Registriert seit
    19.07.2015
    Beiträge
    214
    Total Downloaded
    62,24 MB
    Total Downloaded
    62,24 MB
    ReceiverDankeAktivitäten
    Box 1:
    VU+ Ultimo OpenATV 5.3
     
     
    Box 2:
    VU+ Uno OpenATV 5.3
     
     
    Box 3:
    VU+ Uno OpenATV 5.3
     
     
    Hab der VM jetzt 4 Kerne, 10 GB Ram und 50 GB HD zugewiesen, mal sehn was passiert

    luft mal noch immer, und hab schon dies meldungen wo ich nicht gany schlau draus werde.
    NOTE: Preparing RunQueue
    NOTE: Executing SetScene Tasks
    NOTE: Executing RunQueue Tasks
    WARNING: Failed to fetch URL ftp://invisible-island.net/ncurses/c...9-20150329.tgz, attempting MIRRORS if available
    WARNING: Failed to fetch URL http://download.gna.org/cryptodev-li...nux-1.7.tar.gz, attempting MIRRORS if available
    WARNING: Failed to fetch URL 404 Not Found, attempting MIRRORS if available
    WARNING: Failed to fetch URL 404 Not Found, attempting MIRRORS if available
    WARNING: Failed to fetch URL 404 Not Found, attempting MIRRORS if available
    WARNING: QA Issue: gstreamer1.0: Files/directories were installed but not shipped in any package:
    /usr/lib/gstreamer-1.0/include
    /usr/lib/gstreamer-1.0/include/gst
    /usr/lib/gstreamer-1.0/include/gst/gstconfig.h
    /usr/share/bash-completion
    /usr/share/bash-completion/helpers
    /usr/share/bash-completion/completions
    /usr/share/bash-completion/helpers/gst
    /usr/share/bash-completion/helpers/gst-completion-helper-1.0
    /usr/share/bash-completion/helpers/.debug
    /usr/share/bash-completion/helpers/.debug/gst-completion-helper-1.0
    /usr/share/bash-completion/completions/gst-inspect-1.0
    /usr/share/bash-completion/completions/gst-launch-1.0
    Please set FILES such that these items are packaged. Alternatively if they are unneeded, avoid installing them or delete them within do_install. [installed-vs-shipped]
    Geändert von Tommy82h (11.10.2015 um 21:37 Uhr)

  9. #219
    Senior Mitglied
    Registriert seit
    19.07.2015
    Beiträge
    214
    Total Downloaded
    62,24 MB
    Total Downloaded
    62,24 MB
    ReceiverDankeAktivitäten
    Box 1:
    VU+ Ultimo OpenATV 5.3
     
     
    Box 2:
    VU+ Uno OpenATV 5.3
     
     
    Box 3:
    VU+ Uno OpenATV 5.3
     
     
    so, das speicher problem besteht nicht mehr, und luft auch weit durch, bis er dann pltylich mit dieser meldung abbrichtö
    Code:
    NOTE: Executing SetScene Tasks
    NOTE: Executing RunQueue Tasks
    WARNING: Failed to fetch URL ftp://invisible-island.net/ncurses/current/ncurses-5.9-20150329.tgz, attempting MIRRORS if available
    WARNING: Failed to fetch URL http://download.gna.org/cryptodev-linux/cryptodev-linux-1.7.tar.gz, attempting MIRRORS if available
    WARNING: Failed to fetch URL http://www.apache.org/dist/apr/apr-1.5.1.tar.bz2, attempting MIRRORS if available
    WARNING: Failed to fetch URL http://www.apache.org/dist/apr/apr-util-1.5.3.tar.gz, attempting MIRRORS if available
    WARNING: Failed to fetch URL http://www.apache.org/dist/subversion/subversion-1.8.13.tar.bz2, attempting MIRRORS if available
    WARNING: QA Issue: gstreamer1.0: Files/directories were installed but not shipped in any package:
      /usr/lib/gstreamer-1.0/include
      /usr/lib/gstreamer-1.0/include/gst
      /usr/lib/gstreamer-1.0/include/gst/gstconfig.h
      /usr/share/bash-completion
      /usr/share/bash-completion/helpers
      /usr/share/bash-completion/completions
      /usr/share/bash-completion/helpers/gst
      /usr/share/bash-completion/helpers/gst-completion-helper-1.0
      /usr/share/bash-completion/helpers/.debug
      /usr/share/bash-completion/helpers/.debug/gst-completion-helper-1.0
      /usr/share/bash-completion/completions/gst-inspect-1.0
      /usr/share/bash-completion/completions/gst-launch-1.0
    Please set FILES such that these items are packaged. Alternatively if they are unneeded, avoid installing them or delete them within do_install. [installed-vs-shipped]
    WARNING: QA Issue: bluez5: configure was passed unrecognised options: --enable-hidd --disable-udevrules [unknown-configure-option]
    WARNING: Failed to fetch URL http://download.berlios.de/pythonwifi/python-wifi-0.5.0.tar.bz2, attempting MIRRORS if available
    WARNING: QA Issue: gstreamer1.0 rdepends on libcap, but it isn't a build dependency? [build-deps]
    WARNING: QA Issue: libungif-utils rdepends on libx11, but it isn't a build dependency? [build-deps]
    WARNING: QA Issue: /usr/bin/gifburst_libungif-utils contained in package libungif-utils requires /usr/bin/perl, but no providers found in its RDEPENDS [file-rdeps]
    WARNING: QA Issue: libungif rdepends on libx11, but it isn't a build dependency? [build-deps]
    WARNING: QA Issue: /usr/bin/wvtestrun_wvstreams contained in package wvstreams requires /usr/bin/perl, but no providers found in its RDEPENDS [file-rdeps]
    WARNING: QA Issue: File '/usr/bin/tda1002x' from vuplus-blindscan-utils was already stripped, this will prevent future debugging! [already-stripped]
    WARNING: QA Issue: vuplus-blindscan-utils: Files/directories were installed but not shipped in any package:
      /usr/bin/.debug/tt3l10
      /usr/bin/.debug/tt3l10_t2_scan
    Please set FILES such that these items are packaged. Alternatively if they are unneeded, avoid installing them or delete them within do_install. [installed-vs-shipped]
    WARNING: Failed to fetch URL http://jerakeen.org/files/PythonDaap-0.7.1.tar.gz, attempting MIRRORS if available
    WARNING: QA Issue: File '/usr/bin/nmap' from nmap was already stripped, this will prevent future debugging! [already-stripped]
    WARNING: Failed to fetch URL http://cdrkit.org/releases/cdrkit-1.1.10.tar.gz;name=archive, attempting MIRRORS if available
    WARNING: QA Issue: /usr/bin/dirsplit_cdrkit contained in package cdrkit requires /usr/bin/perl, but no providers found in its RDEPENDS [file-rdeps]
    WARNING: QA Issue: File '/usr/bin/ushare' from ushare was already stripped, this will prevent future debugging! [already-stripped]
    WARNING: QA Issue: gstreamer1.0-plugins-bad: configure was passed unrecognised options: --disable-osx_video --disable-quicktime --disable-directdraw --disable-mythtv [unknown-configure-option]
    WARNING: QA Issue: lcd4linux: configure was passed unrecognised options: --with-glib-prefix --with-glib-exec-prefix [unknown-configure-option]
    WARNING: QA Issue: enigma2-plugin-extensions-webinterface rdepends on aio-grab, but it isn't a build dependency? [build-deps]
    WARNING: QA Issue: enigma2-plugin-extensions-netcaster rdepends on gst-plugins-good-icydemux, but it isn't a build dependency? [build-deps]
    WARNING: QA Issue: enigma2-plugin-extensions-emission rdepends on python-transmissionrpc, but it isn't a build dependency? [build-deps]
    WARNING: QA Issue: enigma2-plugin-extensions-bonjour rdepends on avahi-daemon, but it isn't a build dependency? [build-deps]
    WARNING: QA Issue: enigma2-plugin-extensions-rsdownloader rdepends on python-pycrypto, but it isn't a build dependency? [build-deps]
    WARNING: QA Issue: enigma2-plugin-systemplugins-networkbrowser rdepends on autofs, but it isn't a build dependency? [build-deps]
    WARNING: QA Issue: enigma2-plugin-extensions-fancontrol2 rdepends on smartmontools, but it isn't a build dependency? [build-deps]
    WARNING: QA Issue: enigma2-plugin-extensions-fancontrol2 rdepends on hdparm, but it isn't a build dependency? [build-deps]
    WARNING: QA Issue: enigma2-plugin-extensions-eurotictv rdepends on gst-plugins-bad-fragmented, but it isn't a build dependency? [build-deps]
    WARNING: QA Issue: enigma2-plugin-extensions-eparted rdepends on parted, but it isn't a build dependency? [build-deps]
    WARNING: QA Issue: enigma2-plugin-extensions-ecasa rdepends on python-flickrapi, but it isn't a build dependency? [build-deps]
    WARNING: QA Issue: enigma2-plugin-extensions-internetradio rdepends on gst-plugins-bad-faad, but it isn't a build dependency? [build-deps]
    WARNING: QA Issue: enigma2-plugin-extensions-internetradio rdepends on gst-plugins-good-spectrum, but it isn't a build dependency? [build-deps]
    WARNING: QA Issue: enigma2-plugin-extensions-mosaic rdepends on aio-grab, but it isn't a build dependency? [build-deps]
    WARNING: QA Issue: enigma2-plugin-extensions-teletext rdepends on dbttcd, but it isn't a build dependency? [build-deps]
    WARNING: QA Issue: enigma2-plugin-extensions-cdinfo rdepends on cdtextinfo, but it isn't a build dependency? [build-deps]
    WARNING: QA Issue: enigma2-plugin-extensions-subsdownloader2 rdepends on gst-plugins-good-flv, but it isn't a build dependency? [build-deps]
    WARNING: QA Issue: enigma2-plugin-extensions-dvdbackup rdepends on cdrkit, but it isn't a build dependency? [build-deps]
    WARNING: Failed to fetch URL http://ftp.de.debian.org/debian/pool/main/i/id3lib3.8.3/id3lib3.8.3_3.8.3-7.2.diff.gz;name=patch, attempting MIRRORS if available
    WARNING: QA Issue: gstreamer1.0-plugins-good: configure was passed unrecognised options: --enable-xshm [unknown-configure-option]
    WARNING: QA Issue: enigma2-plugin-extensions-bitrate: configure was passed unrecognised options: --with-boxtype [unknown-configure-option]
    WARNING: File 'usr/lib/python2.7/lib-dynload/_crossepg.so' from enigma2-plugin-systemplugins-crossepg was already stripped, this will prevent future debugging!
    WARNING: QA Issue: enigma2-plugin-systemplugins-crossepg rdepends on enigma2, but it isn't a build dependency? [build-deps]
    WARNING: QA Issue: enigma2-plugin-systemplugins-crossepg: found library in wrong location: /usr/crossepg/libcrossepg.so [libdir]
    WARNING: Failed to fetch URL ftp://ftp.mozilla.org/pub/mozilla.org/nspr/releases/v4.10.8/src/nspr-4.10.8.tar.gz, attempting MIRRORS if available
    WARNING: QA Issue: enigma2-plugin-extensions-yahooweather: configure was passed unrecognised options: --with-boxtype --with-po --with-libsdl [unknown-configure-option]
    WARNING: QA Issue: enigma2-plugin-systemplugins-wirelesslan rdepends on wireless-tools, but it isn't a build dependency? [build-deps]
    WARNING: QA Issue: enigma2-plugin-systemplugins-wirelesslan rdepends on wpa-supplicant, but it isn't a build dependency? [build-deps]
    WARNING: QA Issue: enigma2-plugin-extensions-dvdburn rdepends on cdrkit, but it isn't a build dependency? [build-deps]
    WARNING: QA Issue: enigma2-plugin-extensions-dvdburn rdepends on dvd+rw-tools, but it isn't a build dependency? [build-deps]
    WARNING: QA Issue: enigma2-plugin-extensions-dvdburn rdepends on mjpegtools, but it isn't a build dependency? [build-deps]
    WARNING: QA Issue: enigma2-plugin-extensions-dvdburn rdepends on dvdauthor, but it isn't a build dependency? [build-deps]
    WARNING: QA Issue: enigma2-plugin-extensions-dvdburn rdepends on replex, but it isn't a build dependency? [build-deps]
    WARNING: QA Issue: enigma2-plugin-extensions-cutlisteditor rdepends on aio-grab, but it isn't a build dependency? [build-deps]
    WARNING: File 'home/thomas/openatv/build-enviroment/builds/openatv/release/vuuno/tmp/sysroots/x86_64-linux/usr/bin/bjam' from bjam-native was already stripped, this will prevent future debugging!
    WARNING: QA Issue: libao: configure was passed unrecognised options: --enable-oss [unknown-configure-option]
    WARNING: QA Issue: dvdauthor rdepends on fontconfig, but it isn't a build dependency? [build-deps]
    WARNING: QA Issue: enigma2-plugin-picons-ziggo.tvhome: Files/directories were installed but not shipped in any package:
      /picon/cable_Ziggo_radio_Wereldomroep (RNW).png
      /picon/cable_Ziggo_radio_Silk (Love Songs).png
    Please set FILES such that these items are packaged. Alternatively if they are unneeded, avoid installing them or delete them within do_install. [installed-vs-shipped]
    WARNING: QA Issue: enigma2-plugin-drivers-dvb-usb-a867 rdepends on kernel-module-dvb-usb-a867, but it isn't a build dependency? [build-deps]
    ERROR: Function failed: do_fetch (log file is located at /home/thomas/openatv/build-enviroment/builds/openatv/release/vuuno/tmp/work/mips32el-oe-linux/vuplus-opera-browser-util/1.0-r42_20150622_0/temp/log.do_fetch.20900)
    ERROR: Logfile of failure stored in: /home/thomas/openatv/build-enviroment/builds/openatv/release/vuuno/tmp/work/mips32el-oe-linux/vuplus-opera-browser-util/1.0-r42_20150622_0/temp/log.do_fetch.20900
    Log data follows:
    | DEBUG: Executing shell function do_fetch
    | cp: cannot stat '/home/thomas/openatv/build-enviroment/sources/opera-hbbtv_20150622_0.tar.gz': No such file or directory
    | WARNING: exit code 1 from a shell command.
    | ERROR: Function failed: do_fetch (log file is located at /home/thomas/openatv/build-enviroment/builds/openatv/release/vuuno/tmp/work/mips32el-oe-linux/vuplus-opera-browser-util/1.0-r42_20150622_0/temp/log.do_fetch.20900)
    ERROR: Task 3003 (/home/thomas/openatv/build-enviroment/meta-oe-alliance/meta-brands/meta-vuplus/recipes-bsp/vuplus-opera-browser-util.bb, do_fetch) failed with exit code '1'
    NOTE: Tasks Summary: Attempted 7339 tasks of which 1 didn't need to be rerun and 1 failed.
    Waiting for 0 running tasks to finish:
    
    Summary: 1 task failed:
      /home/thomas/openatv/build-enviroment/meta-oe-alliance/meta-brands/meta-vuplus/recipes-bsp/vuplus-opera-browser-util.bb, do_fetch
    Summary: There were 134 WARNING messages shown.
    Summary: There was 1 ERROR message shown, returning a non-zero exit code.
    Makefile:570: recipe for target 'image' failed
    make: *** [image] Error 1
    was luft schief und vorallem was kann ich tun-

    danke

  10. #220
    Anfänger
    Registriert seit
    26.04.2015
    Beiträge
    3
    Total Downloaded
    0
    Total Downloaded
    0
    ReceiverDankeAktivitäten
    Da fehlt dir das notwendige File im Source-Ordner

    Gesendet von meinem SM-G900F mit Tapatalk


Seite 22 von 34 ErsteErste ... 12202122232432 ... LetzteLetzte

Stichworte

Lesezeichen

Berechtigungen

  • Neue Themen erstellen: Nein
  • Themen beantworten: Nein
  • Anhänge hochladen: Nein
  • Beiträge bearbeiten: Nein
  •  
Diese Website benutzt Cookies
Wir benutzen Cookies um Sitzungsinformationen zu speichern. Dies erleichtert es uns z.B. Dich an Deine Login zu erinnern, Einstellungen der Webseite zu speichern, Inhalte und Werbung zu personalisieren, Social Media Funktionen anzubieten und unser Datenaufkommen zu analysieren. Wir teilen diese Informationen ebenfalls mit unseren Social Media-, Werbe- und Analysepartnern.
     
Alle Zeitangaben in WEZ +1. Es ist jetzt 17:12 Uhr.
Powered by vBulletin® Version 4.2.3 (Deutsch)
Copyright ©2017 Adduco Digital e.K. und vBulletin Solutions, Inc. Alle Rechte vorbehalten.
Resources saved on this page: MySQL 11,76%
Parts of this site powered by vBulletin Mods & Addons from DragonByte Technologies Ltd. (Details)
vBulletin Skin By: PurevB.com