Thanks Thanks:  100
Seite 2 von 34 ErsteErste 123412 ... LetzteLetzte
Ergebnis 11 bis 20 von 331
  1. #11
    Anfänger
    Registriert seit
    18.07.2014
    Beiträge
    8
    Total Downloaded
    0
    Total Downloaded
    0
    ReceiverDankeAktivitäten
    Box 1:
    IPBOX 900HD mit HDMU
     
     
    Box 2:
    Cuberevo 250HD mit Titan im flash
     
     
    Box 3:
    Cuberevo mini2 mit PKT 5.3
     
     
    Bei mir hängt es auch hier, wie geht es weiter?

    --- edit ---

    Nun hat jetzt durch gebaut

    Code:
    ghani@ghani-MS-6567V2:~/openatv/build-enviroment$ MACHINE=amiko8900 DISTRO=openatv make image
    Generating /home/ghani/openatv/build-enviroment/builds/openatv/spark/env.source
    NOTE: Started PRServer with DBfile: /home/ghani/openatv/build-enviroment/builds/openatv/spark/cache/prserv.sqlite3, IP: 127.0.0.1, PORT: 56702, PID: 3595
    ERROR:  OE-core's config sanity checker detected a potential misconfiguration.
        Either fix the cause of this error or at your own risk disable the checker (see sanity.conf).
        Following is the list of potential problems / advisories:
    
        Please install the following missing utilities: diffstat,chrpath
    /bin/mknod has the setuid bit set. This interferes with pseudo and may cause other issues that break the build process.
    
    
    Summary: There was 1 ERROR message shown, returning a non-zero exit code.
    make: *** [image] Fehler 1
    ghani@ghani-MS-6567V2:~/openatv/build-enviroment$
    Geändert von ghani (20.07.2014 um 19:49 Uhr)

    •   Alt Advertising

       

  2. #12
    Anfänger
    Registriert seit
    18.07.2014
    Beiträge
    9
    Total Downloaded
    0
    Total Downloaded
    0
    ReceiverDankeAktivitäten
    Zitat Zitat von ghani Beitrag anzeigen
    Bei mir hängt es auch hier, wie geht es weiter?


    Code:
    ghani@ghani-MS-6567V2:~/openatv/build-enviroment$ MACHINE=amiko8900 DISTRO=openatv make image
    Generating /home/ghani/openatv/build-enviroment/builds/openatv/spark/env.source
    NOTE: Started PRServer with DBfile: /home/ghani/openatv/build-enviroment/builds/openatv/spark/cache/prserv.sqlite3, IP: 127.0.0.1, PORT: 56702, PID: 3595
    ERROR:  OE-core's config sanity checker detected a potential misconfiguration.
        Either fix the cause of this error or at your own risk disable the checker (see sanity.conf).
        Following is the list of potential problems / advisories:
    
        Please install the following missing utilities: diffstat,chrpath
    /bin/mknod has the setuid bit set. This interferes with pseudo and may cause other issues that break the build process.
    
    
    Summary: There was 1 ERROR message shown, returning a non-zero exit code.
    make: *** [image] Fehler 1
    ghani@ghani-MS-6567V2:~/openatv/build-enviroment$
    what you want you are the reponse

    Code:
    Please install the following missing utilities: diffstat,chrpath
    open terminal and install this package

    Code:
    sudo apt-get install diffstat
    Code:
    sudo apt-get install chrpath

  3. Thanks ghani bedankten sich
  4. #13
    Avatar von Captain
    Registriert seit
    03.04.2013
    Beiträge
    9.469
    Themenstarter
    Total Downloaded
    162,35 MB
    Total Downloaded
    162,35 MB
    ReceiverDankeAktivitäten
    Info im ersten Post erweitert wegen diffstat,chrpath

  5. Thanks ghani bedankten sich
  6. #14
    Mitglied
    Registriert seit
    02.10.2013
    Beiträge
    46
    Total Downloaded
    0
    Total Downloaded
    0
    ReceiverDankeAktivitäten
    Box 1:
    Golden Media Reloaded SPARK
     
     
    Golden Media Reloaded SPARK Sti7111

  7. #15
    Avatar von Captain
    Registriert seit
    03.04.2013
    Beiträge
    9.469
    Themenstarter
    Total Downloaded
    162,35 MB
    Total Downloaded
    162,35 MB
    ReceiverDankeAktivitäten
    Zitat Zitat von pop1234 Beitrag anzeigen

    we have test build only with Ubunto 12_4 LTE 64 bit

    i am not see your issue:

  8. #16
    Mitglied
    Registriert seit
    02.10.2013
    Beiträge
    46
    Total Downloaded
    0
    Total Downloaded
    0
    ReceiverDankeAktivitäten
    Box 1:
    Golden Media Reloaded SPARK
     
     
    @captain

    Ubuntu 12.04 LTS 32 bit
    Golden Media Reloaded SPARK Sti7111

  9. #17
    Avatar von Captain
    Registriert seit
    03.04.2013
    Beiträge
    9.469
    Themenstarter
    Total Downloaded
    162,35 MB
    Total Downloaded
    162,35 MB
    ReceiverDankeAktivitäten
    i think 32 works too

    clean you build and start fresh again , you must build as a user not root !!!!!!!!!!!!!!

    and install all parts we have add in the howto

  10. Thanks ghani bedankten sich
  11. #18
    Mitglied
    Registriert seit
    02.10.2013
    Beiträge
    46
    Total Downloaded
    0
    Total Downloaded
    0
    ReceiverDankeAktivitäten
    Box 1:
    Golden Media Reloaded SPARK
     
     
    @Captain & Grle

    pictures of all remote Spark and Spark7162

    Spark: 404 Not Found

    Spark7162: 404 Not Found
    Geändert von pop1234 (20.07.2014 um 14:48 Uhr)
    Golden Media Reloaded SPARK Sti7111

  12. #19
    Mitglied
    Registriert seit
    02.10.2013
    Beiträge
    46
    Total Downloaded
    0
    Total Downloaded
    0
    ReceiverDankeAktivitäten
    Box 1:
    Golden Media Reloaded SPARK
     
     
    @Captain


    spark7111@ubuntu: this user section

    spark7111@ubuntu:~$ sudo apt-get install -y autoconf automake bison bzip2 cvs diffstat flex g++ gawk gcc gettext git-core gzip help2man ncurses-bin ncurses-dev libc6-dev libtool make texinfo patch perl pkg-config subversion tar texi2html wget zlib1g-dev chrpath libxml2-utils xsltproc libglib2.0-dev python-setuptools zip info coreutils diffstat chrpath
    Reading package lists... Done
    Building dependency tree
    Reading state information... Done
    Note, selecting 'libncurses5-dev' instead of 'ncurses-dev'
    autoconf is already the newest version.
    automake is already the newest version.
    bison is already the newest version.
    bzip2 is already the newest version.
    chrpath is already the newest version.
    cvs is already the newest version.
    diffstat is already the newest version.
    flex is already the newest version.
    g++ is already the newest version.
    gawk is already the newest version.
    gcc is already the newest version.
    gettext is already the newest version.
    git-core is already the newest version.
    gzip is already the newest version.
    help2man is already the newest version.
    info is already the newest version.
    libncurses5-dev is already the newest version.
    libtool is already the newest version.
    ncurses-bin is already the newest version.
    patch is already the newest version.
    pkg-config is already the newest version.
    python-setuptools is already the newest version.
    tar is already the newest version.
    texi2html is already the newest version.
    texinfo is already the newest version.
    zip is already the newest version.
    zlib1g-dev is already the newest version.
    coreutils is already the newest version.
    libc6-dev is already the newest version.
    libglib2.0-dev is already the newest version.
    libxml2-utils is already the newest version.
    make is already the newest version.
    perl is already the newest version.
    subversion is already the newest version.
    wget is already the newest version.
    xsltproc is already the newest version.
    0 upgraded, 0 newly installed, 0 to remove and 284 not upgraded.
    spark7111@ubuntu:~$ cd ~/openatv/build-enviroment
    spark7111@ubuntu:~/openatv/build-enviroment$ MACHINE=sparkreloaded DISTRO=openatv make image
    NOTE: Started PRServer with DBfile: /home/spark7111/openatv/build-enviroment/builds/openatv/spark/cache/prserv.sqlite3, IP: 127.0.0.1, PORT: 42041, PID: 8872
    ERROR: OE-core's config sanity checker detected a potential misconfiguration.
    Either fix the cause of this error or at your own risk disable the checker (see sanity.conf).
    Following is the list of potential problems / advisories:


    /bin/mknod has the setuid bit set. This interferes with pseudo and may cause other issues that break the build process.




    Summary: There was 1 ERROR message shown, returning a non-zero exit code.
    make: *** [image] Error 1
    spark7111@ubuntu:~/openatv/build-enviroment$
    Golden Media Reloaded SPARK Sti7111

  13. #20
    Avatar von Captain
    Registriert seit
    03.04.2013
    Beiträge
    9.469
    Themenstarter
    Total Downloaded
    162,35 MB
    Total Downloaded
    162,35 MB
    ReceiverDankeAktivitäten
    yous you bash not dash ?


Seite 2 von 34 ErsteErste 123412 ... LetzteLetzte

Stichworte

Lesezeichen

Berechtigungen

  • Neue Themen erstellen: Nein
  • Themen beantworten: Nein
  • Anhänge hochladen: Nein
  • Beiträge bearbeiten: Nein
  •  
Diese Website benutzt Cookies
Wir benutzen Cookies um Sitzungsinformationen zu speichern. Dies erleichtert es uns z.B. Dich an Deine Login zu erinnern, Einstellungen der Webseite zu speichern, Inhalte und Werbung zu personalisieren, Social Media Funktionen anzubieten und unser Datenaufkommen zu analysieren. Wir teilen diese Informationen ebenfalls mit unseren Social Media-, Werbe- und Analysepartnern.
     
Alle Zeitangaben in WEZ +1. Es ist jetzt 13:06 Uhr.
Powered by vBulletin® Version 4.2.3 (Deutsch)
Copyright ©2017 Adduco Digital e.K. und vBulletin Solutions, Inc. Alle Rechte vorbehalten.
Resources saved on this page: MySQL 10,00%
Parts of this site powered by vBulletin Mods & Addons from DragonByte Technologies Ltd. (Details)
vBulletin Skin By: PurevB.com